{"text_format":"1","workbook":"xlsx","n_sheets":4,"sheets":["Opgaveblad","Schema","Deelnemende landen","fifaschema"],"not_rendered":{"charts":0,"images":1,"macros":1,"external_links":0,"defined_names":2,"comments":1,"pivot_tables":0},"unopened":[],"bounds":{"document_bytes":16777216,"sheet_cells":100000,"rows_first":2000,"rows_last":500,"rows_between":2000,"halvings":0,"cell_chars":16384,"cell_head_chars":4096},"cells_cut":0,"cells_raw":0,"read":"whole","date_system":"1900"}

{"sheet":"Opgaveblad","index":0,"n_rows":101,"n_cols":191,"rows_kept":101,"cut":false,"hidden":false,"merged":[[4,4,4,8],[0,4,0,8],[1,4,1,8],[2,4,2,8],[3,4,3,8]]}
["Naam:",null,null,null,null,null,null,null,null,null,"Inschrijvingen en betaling dienen uiterlijk 12.06.2010 om 22.00 uur in het  bezit te zijn ",null,null,null,null,null,null,null,null,null,null,null,null,null,null,null,null,{"$f":"E1","v":0},{"$f":"E2","v":0},{"$f":"E3","v":0},{"$f":"F10","v":0},{"$f":"I10","v":0},{"$f":"F11","v":0},{"$f":"I11","v":0},{"$f":"F12","v":0},{"$f":"I12","v":0},{"$f":"F13","v":0},{"$f":"I13","v":0},{"$f":"F14","v":0},{"$f":"I14","v":0},{"$f":"F15","v":0},{"$f":"I15","v":0},{"$f":"F18","v":0},{"$f":"I18","v":0},{"$f":"F19","v":0},{"$f":"I19","v":0},{"$f":"F20","v":0},{"$f":"I20","v":0},{"$f":"F21","v":0},{"$f":"I21","v":0},{"$f":"F22","v":0},{"$f":"I22","v":0},{"$f":"F23","v":0},{"$f":"I23","v":0},{"$f":"F26","v":0},{"$f":"I26","v":0},{"$f":"F27","v":0},{"$f":"I27","v":0},{"$f":"F28","v":0},{"$f":"I28","v":0},{"$f":"F29","v":0},{"$f":"I29","v":0},{"$f":"F30","v":0},{"$f":"I30","v":0},{"$f":"F31","v":0},{"$f":"I31","v":0},{"$f":"F34","v":0},{"$f":"I34","v":0},{"$f":"F35","v":0},{"$f":"I35","v":0},{"$f":"F36","v":0},{"$f":"I36","v":0},{"$f":"F37","v":0},{"$f":"I37","v":0},{"$f":"F38","v":0},{"$f":"I38","v":0},{"$f":"F39","v":0},{"$f":"I39","v":0},{"$f":"P10","v":0},{"$f":"S10","v":0},{"$f":"P11","v":0},{"$f":"S11","v":0},{"$f":"P12","v":0},{"$f":"S12","v":0},{"$f":"P13","v":0},{"$f":"S13","v":0},{"$f":"P14","v":0},{"$f":"S14","v":0},{"$f":"P15","v":0},{"$f":"S15","v":0},{"$f":"P18","v":0},{"$f":"S18","v":0},{"$f":"P19","v":0},{"$f":"S19","v":0},{"$f":"P20","v":0},{"$f":"S20","v":0},{"$f":"P21","v":0},{"$f":"S21","v":0},{"$f":"P22","v":0},{"$f":"S22","v":0},{"$f":"P23","v":0},{"$f":"S23","v":0},{"$f":"P26","v":0},{"$f":"S26","v":0},{"$f":"P27","v":0},{"$f":"S27","v":0},{"$f":"P28","v":0},{"$f":"S28","v":0},{"$f":"P29","v":0},{"$f":"S29","v":0},{"$f":"P30","v":0},{"$f":"S30","v":0},{"$f":"P31","v":0},{"$f":"S31","v":0},{"$f":"P34","v":0},{"$f":"S34","v":0},{"$f":"P35","v":0},{"$f":"S35","v":0},{"$f":"P36","v":0},{"$f":"S36","v":0},{"$f":"P37","v":0},{"$f":"S37","v":0},{"$f":"P38","v":0},{"$f":"S38","v":0},{"$f":"P39","v":0},{"$f":"S39","v":0},{"$f":"D43","v":0},{"$f":"D44","v":0},{"$f":"D45","v":0},{"$f":"D46","v":0},{"$f":"D47","v":0},{"$f":"D48","v":0},{"$f":"D49","v":0},{"$f":"D50","v":0},{"$f":"N43","v":0},{"$f":"N44","v":0},{"$f":"N45","v":0},{"$f":"N46","v":0},{"$f":"N47","v":0},{"$f":"N48","v":0},{"$f":"N49","v":0},{"$f":"N50","v":0},{"$f":"F53","v":0},{"$f":"I53","v":0},{"$f":"F54","v":0},{"$f":"I54","v":0},{"$f":"F55","v":0},{"$f":"I55","v":0},{"$f":"F56","v":0},{"$f":"I56","v":0},{"$f":"F57","v":0},{"$f":"I57","v":0},{"$f":"F58","v":0},{"$f":"I58","v":0},{"$f":"F59","v":0},{"$f":"I59","v":0},{"$f":"F60","v":0},{"$f":"I60","v":0},{"$f":"D64","v":0},{"$f":"D65","v":0},{"$f":"D66","v":0},{"$f":"D67","v":0},{"$f":"D68","v":0},{"$f":"D69","v":0},{"$f":"D70","v":0},{"$f":"D71","v":0},{"$f":"F74","v":0},{"$f":"I74","v":0},{"$f":"F75","v":0},{"$f":"I75","v":0},{"$f":"F76","v":0},{"$f":"I76","v":0},{"$f":"F77","v":0},{"$f":"I77","v":0},{"$f":"D81","v":0},{"$f":"D82","v":0},{"$f":"D83","v":0},{"$f":"D84","v":0},{"$f":"F87","v":0},{"$f":"I87","v":0},{"$f":"F88","v":0},{"$f":"I88","v":0},{"$f":"D92","v":0},{"$f":"D93","v":0},{"$f":"F96","v":0},{"$f":"I96","v":0},{"$f":"F99","v":0},{"$f":"I99","v":0},{"$f":"G101","v":0},{"$f":"E4","v":0},{"$f":"E5","v":0}]
["Adres:",null,null,null,null,null,null,null,null,null,"van de organisatie. Formulieren bij voorkeur mailen naar: "]
["Woonplaats:",null,null,null,null,null,null,null,null,null,null,"voetbalpoule.jammerdan@gmail.com"]
["E-mail:",null,null,null,null,null,null,null,null,null,"Betalingen en niet-digitale formulieren inleveren bij:"]
["Ik betaal aan:",null,null,null,null,null,null,null,null,null,"Uwe, Alfred, Berné, Ekkel, Niels, Jurgen, Het Oude Station"]
["Groepswedstrijden",null,null,null,"U dient van iedere wedstrijd de uitslag te voorspellen (stand na afloop van de reguliere speeltijd van 2x3 kwartier)."]
[null,null,null,null,"Poulewedstrijden: juiste voorspelling winst, verlies of een gelijkspel ",null,null,null,null,null,null,null,null,null," = ","3 punten (toto)"]
[null,"Groep A",null,null,"Poulewedstrijden: juiste voorspelling winst, verlies of een gelijkspel en de juiste uitslag",null,null,null,null,null,null,null,null,null," = ","3 punten extra (uitslag)"]
[null,"Wedstrijden",null,null,null,null,null,null,"3 punten voor Toto + 3 bonuspunten voor juiste uitslag",null,null,"Wedstrijden",null,null,null,null,null,null,"3 punten voor Toto + 3 bonuspunten voor juiste uitslag"]
[null,{"$f":"Schema!B9","v":"2014-06-12"},{"$f":"Schema!C9","v":"22:00:00"},{"$f":"Schema!D9","v":10},{"$f":"LOOKUP(D10,'Deelnemende landen'!$B$7:$B$38,'Deelnemende landen'!$D$7:$D$38)","v":"Brazilië"},null,{"$f":"Schema!G9","v":11},{"$f":"LOOKUP(G10,'Deelnemende landen'!$B$7:$B$38,'Deelnemende landen'!$D$7:$D$38)","v":"Kroatië"},null,null,null,{"$f":"Schema!N9","v":"2014-06-15"},{"$f":"Schema!O9","v":"18:00:00"},{"$f":"Schema!P9","v":50},{"$f":"LOOKUP(N10,'Deelnemende landen'!$B$7:$B$38,'Deelnemende landen'!$D$7:$D$38)","v":"Zwitserland"},null,{"$f":"Schema!S9","v":51},{"$f":"LOOKUP(Q10,'Deelnemende landen'!$B$7:$B$38,'Deelnemende landen'!$D$7:$D$38)","v":"Ecuador"}]
[null,{"$f":"Schema!B10","v":"2014-06-13"},{"$f":"Schema!C10","v":"18:00:00"},{"$f":"Schema!D10","v":12},{"$f":"LOOKUP(D11,'Deelnemende landen'!$B$7:$B$38,'Deelnemende landen'!$D$7:$D$38)","v":"Mexico"},null,{"$f":"Schema!G10","v":13},{"$f":"LOOKUP(G11,'Deelnemende landen'!$B$7:$B$38,'Deelnemende landen'!$D$7:$D$38)","v":"Kameroen"},null,null,null,{"$f":"Schema!N10","v":"2014-06-15"},{"$f":"Schema!O10","v":"21:00:00"},{"$f":"Schema!P10","v":52},{"$f":"LOOKUP(N11,'Deelnemende landen'!$B$7:$B$38,'Deelnemende landen'!$D$7:$D$38)","v":"Frankrijk"},null,{"$f":"Schema!S10","v":53},{"$f":"LOOKUP(Q11,'Deelnemende landen'!$B$7:$B$38,'Deelnemende landen'!$D$7:$D$38)","v":"Honduras"}]
[null,{"$f":"Schema!B11","v":"2014-06-17"},{"$f":"Schema!C11","v":"21:00:00"},{"$f":"Schema!D11","v":10},{"$f":"LOOKUP(D12,'Deelnemende landen'!$B$7:$B$38,'Deelnemende landen'!$D$7:$D$38)","v":"Brazilië"},null,{"$f":"Schema!G11","v":12},{"$f":"LOOKUP(G12,'Deelnemende landen'!$B$7:$B$38,'Deelnemende landen'!$D$7:$D$38)","v":"Mexico"},null,null,null,{"$f":"Schema!N11","v":"2014-06-20"},{"$f":"Schema!O11","v":"21:00:00"},{"$f":"Schema!P11","v":50},{"$f":"LOOKUP(N12,'Deelnemende landen'!$B$7:$B$38,'Deelnemende landen'!$D$7:$D$38)","v":"Zwitserland"},null,{"$f":"Schema!S11","v":52},{"$f":"LOOKUP(Q12,'Deelnemende landen'!$B$7:$B$38,'Deelnemende landen'!$D$7:$D$38)","v":"Frankrijk"}]
[null,{"$f":"Schema!B12","v":"2014-06-18"},{"$f":"Schema!C12","v":"00:00:00"},{"$f":"Schema!D12","v":13},{"$f":"LOOKUP(D13,'Deelnemende landen'!$B$7:$B$38,'Deelnemende landen'!$D$7:$D$38)","v":"Kameroen"},null,{"$f":"Schema!G12","v":11},{"$f":"LOOKUP(G13,'Deelnemende landen'!$B$7:$B$38,'Deelnemende landen'!$D$7:$D$38)","v":"Kroatië"},null,null,null,{"$f":"Schema!N12","v":"2014-06-20"},{"$f":"Schema!O12","v":"00:00:00"},{"$f":"Schema!P12","v":53},{"$f":"LOOKUP(N13,'Deelnemende landen'!$B$7:$B$38,'Deelnemende landen'!$D$7:$D$38)","v":"Honduras"},null,{"$f":"Schema!S12","v":51},{"$f":"LOOKUP(Q13,'Deelnemende landen'!$B$7:$B$38,'Deelnemende landen'!$D$7:$D$38)","v":"Ecuador"}]
[null,{"$f":"Schema!B13","v":"2014-06-23"},{"$f":"Schema!C13","v":"22:00:00"},{"$f":"Schema!D13","v":13},{"$f":"LOOKUP(D14,'Deelnemende landen'!$B$7:$B$38,'Deelnemende landen'!$D$7:$D$38)","v":"Kameroen"},null,{"$f":"Schema!G13","v":10},{"$f":"LOOKUP(G14,'Deelnemende landen'!$B$7:$B$38,'Deelnemende landen'!$D$7:$D$38)","v":"Brazilië"},null,null,null,{"$f":"Schema!N13","v":"2014-06-25"},{"$f":"Schema!O13","v":"22:00:00"},{"$f":"Schema!P13","v":53},{"$f":"LOOKUP(N14,'Deelnemende landen'!$B$7:$B$38,'Deelnemende landen'!$D$7:$D$38)","v":"Honduras"},null,{"$f":"Schema!S13","v":50},{"$f":"LOOKUP(Q14,'Deelnemende landen'!$B$7:$B$38,'Deelnemende landen'!$D$7:$D$38)","v":"Zwitserland"}]
[null,{"$f":"Schema!B14","v":"2014-06-23"},{"$f":"Schema!C14","v":"22:00:00"},{"$f":"Schema!D14","v":11},{"$f":"LOOKUP(D15,'Deelnemende landen'!$B$7:$B$38,'Deelnemende landen'!$D$7:$D$38)","v":"Kroatië"},null,{"$f":"Schema!G14","v":12},{"$f":"LOOKUP(G15,'Deelnemende landen'!$B$7:$B$38,'Deelnemende landen'!$D$7:$D$38)","v":"Mexico"},null,null,null,{"$f":"Schema!N14","v":"2014-06-25"},{"$f":"Schema!O14","v":"22:00:00"},{"$f":"Schema!P14","v":51},{"$f":"LOOKUP(N15,'Deelnemende landen'!$B$7:$B$38,'Deelnemende landen'!$D$7:$D$38)","v":"Ecuador"},null,{"$f":"Schema!S14","v":52},{"$f":"LOOKUP(Q15,'Deelnemende landen'!$B$7:$B$38,'Deelnemende landen'!$D$7:$D$38)","v":"Frankrijk"}]
[null,"Groep B",null,null,null,null,null,null,null,null,null,"Groep F"]
[null,"Wedstrijden",null,null,null,null,null,null,"3 punten voor Toto + 3 bonuspunten voor juiste uitslag",null,null,"Wedstrijden",null,null,null,null,null,null,"3 punten voor Toto + 3 bonuspunten voor juiste uitslag"]
[null,{"$f":"Schema!B18","v":"2014-06-13"},{"$f":"Schema!C18","v":"21:00:00"},{"$f":"Schema!D18","v":20},{"$f":"LOOKUP(D18,'Deelnemende landen'!$B$7:$B$38,'Deelnemende landen'!$D$7:$D$38)","v":"Spanje"},null,{"$f":"Schema!G18","v":21},{"$f":"LOOKUP(G18,'Deelnemende landen'!$B$7:$B$38,'Deelnemende landen'!$D$7:$D$38)","v":"Nederland"},null,null,null,{"$f":"Schema!N18","v":"2014-06-15"},{"$f":"Schema!O18","v":"00:00:00"},{"$f":"Schema!P18","v":60},{"$f":"LOOKUP(N18,'Deelnemende landen'!$B$7:$B$38,'Deelnemende landen'!$D$7:$D$38)","v":"Argentinië"},null,{"$f":"Schema!S18","v":61},{"$f":"LOOKUP(Q18,'Deelnemende landen'!$B$7:$B$38,'Deelnemende landen'!$D$7:$D$38)","v":"Bosnië Herzegovina"}]
[null,{"$f":"Schema!B19","v":"2014-06-13"},{"$f":"Schema!C19","v":"00:00:00"},{"$f":"Schema!D19","v":22},{"$f":"LOOKUP(D19,'Deelnemende landen'!$B$7:$B$38,'Deelnemende landen'!$D$7:$D$38)","v":"Chili"},null,{"$f":"Schema!G19","v":23},{"$f":"LOOKUP(G19,'Deelnemende landen'!$B$7:$B$38,'Deelnemende landen'!$D$7:$D$38)","v":"Australië"},null,null,null,{"$f":"Schema!N19","v":"2014-06-16"},{"$f":"Schema!O19","v":"21:00:00"},{"$f":"Schema!P19","v":62},{"$f":"LOOKUP(N19,'Deelnemende landen'!$B$7:$B$38,'Deelnemende landen'!$D$7:$D$38)","v":"Iran"},null,{"$f":"Schema!S19","v":63},{"$f":"LOOKUP(Q19,'Deelnemende landen'!$B$7:$B$38,'Deelnemende landen'!$D$7:$D$38)","v":"Nigeria"}]
[null,{"$f":"Schema!B20","v":"2014-06-18"},{"$f":"Schema!C20","v":"21:00:00"},{"$f":"Schema!D20","v":20},{"$f":"LOOKUP(D20,'Deelnemende landen'!$B$7:$B$38,'Deelnemende landen'!$D$7:$D$38)","v":"Spanje"},null,{"$f":"Schema!G20","v":22},{"$f":"LOOKUP(G20,'Deelnemende landen'!$B$7:$B$38,'Deelnemende landen'!$D$7:$D$38)","v":"Chili"},null,null,null,{"$f":"Schema!N20","v":"2014-06-21"},{"$f":"Schema!O20","v":"18:00:00"},{"$f":"Schema!P20","v":60},{"$f":"LOOKUP(N20,'Deelnemende landen'!$B$7:$B$38,'Deelnemende landen'!$D$7:$D$38)","v":"Argentinië"},null,{"$f":"Schema!S20","v":62},{"$f":"LOOKUP(Q20,'Deelnemende landen'!$B$7:$B$38,'Deelnemende landen'!$D$7:$D$38)","v":"Iran"}]
[null,{"$f":"Schema!B21","v":"2014-06-18"},{"$f":"Schema!C21","v":"18:00:00"},{"$f":"Schema!D21","v":23},{"$f":"LOOKUP(D21,'Deelnemende landen'!$B$7:$B$38,'Deelnemende landen'!$D$7:$D$38)","v":"Australië"},null,{"$f":"Schema!G21","v":21},{"$f":"LOOKUP(G21,'Deelnemende landen'!$B$7:$B$38,'Deelnemende landen'!$D$7:$D$38)","v":"Nederland"},null,null,null,{"$f":"Schema!N21","v":"2014-06-21"},{"$f":"Schema!O21","v":"00:00:00"},{"$f":"Schema!P21","v":63},{"$f":"LOOKUP(N21,'Deelnemende landen'!$B$7:$B$38,'Deelnemende landen'!$D$7:$D$38)","v":"Nigeria"},null,{"$f":"Schema!S21","v":61},{"$f":"LOOKUP(Q21,'Deelnemende landen'!$B$7:$B$38,'Deelnemende landen'!$D$7:$D$38)","v":"Bosnië Herzegovina"}]
[null,{"$f":"Schema!B22","v":"2014-06-23"},{"$f":"Schema!C22","v":"18:00:00"},{"$f":"Schema!D22","v":23},{"$f":"LOOKUP(D22,'Deelnemende landen'!$B$7:$B$38,'Deelnemende landen'!$D$7:$D$38)","v":"Australië"},null,{"$f":"Schema!G22","v":20},{"$f":"LOOKUP(G22,'Deelnemende landen'!$B$7:$B$38,'Deelnemende landen'!$D$7:$D$38)","v":"Spanje"},null,null,null,{"$f":"Schema!N22","v":"2014-06-25"},{"$f":"Schema!O22","v":"18:00:00"},{"$f":"Schema!P22","v":63},{"$f":"LOOKUP(N22,'Deelnemende landen'!$B$7:$B$38,'Deelnemende landen'!$D$7:$D$38)","v":"Nigeria"},null,{"$f":"Schema!S22","v":60},{"$f":"LOOKUP(Q22,'Deelnemende landen'!$B$7:$B$38,'Deelnemende landen'!$D$7:$D$38)","v":"Argentinië"}]
[null,{"$f":"Schema!B23","v":"2014-06-23"},{"$f":"Schema!C23","v":"18:00:00"},{"$f":"Schema!D23","v":21},{"$f":"LOOKUP(D23,'Deelnemende landen'!$B$7:$B$38,'Deelnemende landen'!$D$7:$D$38)","v":"Nederland"},null,{"$f":"Schema!G23","v":22},{"$f":"LOOKUP(G23,'Deelnemende landen'!$B$7:$B$38,'Deelnemende landen'!$D$7:$D$38)","v":"Chili"},null,null,null,{"$f":"Schema!N23","v":"2014-06-25"},{"$f":"Schema!O23","v":"18:00:00"},{"$f":"Schema!P23","v":61},{"$f":"LOOKUP(N23,'Deelnemende landen'!$B$7:$B$38,'Deelnemende landen'!$D$7:$D$38)","v":"Bosnië Herzegovina"},null,{"$f":"Schema!S23","v":62},{"$f":"LOOKUP(Q23,'Deelnemende landen'!$B$7:$B$38,'Deelnemende landen'!$D$7:$D$38)","v":"Iran"}]
[null,"Groep C",null,null,null,null,null,null,null,null,null,"Groep G"]
[null,"Wedstrijden",null,null,null,null,null,null,"3 punten voor Toto + 3 bonuspunten voor juiste uitslag",null,null,"Wedstrijden",null,null,null,null,null,null,"3 punten voor Toto + 3 bonuspunten voor juiste uitslag"]
[null,{"$f":"Schema!B27","v":"2014-06-14"},{"$f":"Schema!C27","v":"18:00:00"},{"$f":"Schema!D27","v":30},{"$f":"LOOKUP(D26,'Deelnemende landen'!$B$7:$B$38,'Deelnemende landen'!$D$7:$D$38)","v":"Colombia"},null,{"$f":"Schema!G27","v":31},{"$f":"LOOKUP(G26,'Deelnemende landen'!$B$7:$B$38,'Deelnemende landen'!$D$7:$D$38)","v":"Griekenland"},null,null,null,{"$f":"Schema!N27","v":"2014-06-16"},{"$f":"Schema!O27","v":"18:00:00"},{"$f":"Schema!P27","v":70},{"$f":"LOOKUP(N26,'Deelnemende landen'!$B$7:$B$38,'Deelnemende landen'!$D$7:$D$38)","v":"Duitsland"},null,{"$f":"Schema!S27","v":71},{"$f":"LOOKUP(Q26,'Deelnemende landen'!$B$7:$B$38,'Deelnemende landen'!$D$7:$D$38)","v":"Portugal"}]
[null,{"$f":"Schema!B28","v":"2014-06-14"},{"$f":"Schema!C28","v":"03:00:00"},{"$f":"Schema!D28","v":32},{"$f":"LOOKUP(D27,'Deelnemende landen'!$B$7:$B$38,'Deelnemende landen'!$D$7:$D$38)","v":"Ivoorkust"},null,{"$f":"Schema!G28","v":33},{"$f":"LOOKUP(G27,'Deelnemende landen'!$B$7:$B$38,'Deelnemende landen'!$D$7:$D$38)","v":"Japan"},null,null,null,{"$f":"Schema!N28","v":"2014-06-16"},{"$f":"Schema!O28","v":"00:00:00"},{"$f":"Schema!P28","v":72},{"$f":"LOOKUP(N27,'Deelnemende landen'!$B$7:$B$38,'Deelnemende landen'!$D$7:$D$38)","v":"Ghana"},null,{"$f":"Schema!S28","v":73},{"$f":"LOOKUP(Q27,'Deelnemende landen'!$B$7:$B$38,'Deelnemende landen'!$D$7:$D$38)","v":"USA"}]
[null,{"$f":"Schema!B29","v":"2014-06-19"},{"$f":"Schema!C29","v":"18:00:00"},{"$f":"Schema!D29","v":30},{"$f":"LOOKUP(D28,'Deelnemende landen'!$B$7:$B$38,'Deelnemende landen'!$D$7:$D$38)","v":"Colombia"},null,{"$f":"Schema!G29","v":32},{"$f":"LOOKUP(G28,'Deelnemende landen'!$B$7:$B$38,'Deelnemende landen'!$D$7:$D$38)","v":"Ivoorkust"},null,null,null,{"$f":"Schema!N29","v":"2014-06-21"},{"$f":"Schema!O29","v":"21:00:00"},{"$f":"Schema!P29","v":70},{"$f":"LOOKUP(N28,'Deelnemende landen'!$B$7:$B$38,'Deelnemende landen'!$D$7:$D$38)","v":"Duitsland"},null,{"$f":"Schema!S29","v":72},{"$f":"LOOKUP(Q28,'Deelnemende landen'!$B$7:$B$38,'Deelnemende landen'!$D$7:$D$38)","v":"Ghana"}]
[null,{"$f":"Schema!B30","v":"2014-06-19"},{"$f":"Schema!C30","v":"00:00:00"},{"$f":"Schema!D30","v":33},{"$f":"LOOKUP(D29,'Deelnemende landen'!$B$7:$B$38,'Deelnemende landen'!$D$7:$D$38)","v":"Japan"},null,{"$f":"Schema!G30","v":31},{"$f":"LOOKUP(G29,'Deelnemende landen'!$B$7:$B$38,'Deelnemende landen'!$D$7:$D$38)","v":"Griekenland"},null,null,null,{"$f":"Schema!N30","v":"2014-06-22"},{"$f":"Schema!O30","v":"00:00:00"},{"$f":"Schema!P30","v":73},{"$f":"LOOKUP(N29,'Deelnemende landen'!$B$7:$B$38,'Deelnemende landen'!$D$7:$D$38)","v":"USA"},null,{"$f":"Schema!S30","v":71},{"$f":"LOOKUP(Q29,'Deelnemende landen'!$B$7:$B$38,'Deelnemende landen'!$D$7:$D$38)","v":"Portugal"}]
[null,{"$f":"Schema!B31","v":"2014-06-24"},{"$f":"Schema!C31","v":"22:00:00"},{"$f":"Schema!D31","v":33},{"$f":"LOOKUP(D30,'Deelnemende landen'!$B$7:$B$38,'Deelnemende landen'!$D$7:$D$38)","v":"Japan"},null,{"$f":"Schema!G31","v":30},{"$f":"LOOKUP(G30,'Deelnemende landen'!$B$7:$B$38,'Deelnemende landen'!$D$7:$D$38)","v":"Colombia"},null,null,null,{"$f":"Schema!N31","v":"2014-06-26"},{"$f":"Schema!O31","v":"18:00:00"},{"$f":"Schema!P31","v":73},{"$f":"LOOKUP(N30,'Deelnemende landen'!$B$7:$B$38,'Deelnemende landen'!$D$7:$D$38)","v":"USA"},null,{"$f":"Schema!S31","v":70},{"$f":"LOOKUP(Q30,'Deelnemende landen'!$B$7:$B$38,'Deelnemende landen'!$D$7:$D$38)","v":"Duitsland"}]
[null,{"$f":"Schema!B32","v":"2014-06-24"},{"$f":"Schema!C32","v":"22:00:00"},{"$f":"Schema!D32","v":31},{"$f":"LOOKUP(D31,'Deelnemende landen'!$B$7:$B$38,'Deelnemende landen'!$D$7:$D$38)","v":"Griekenland"},null,{"$f":"Schema!G32","v":32},{"$f":"LOOKUP(G31,'Deelnemende landen'!$B$7:$B$38,'Deelnemende landen'!$D$7:$D$38)","v":"Ivoorkust"},null,null,null,{"$f":"Schema!N32","v":"2014-06-26"},{"$f":"Schema!O32","v":"18:00:00"},{"$f":"Schema!P32","v":71},{"$f":"LOOKUP(N31,'Deelnemende landen'!$B$7:$B$38,'Deelnemende landen'!$D$7:$D$38)","v":"Portugal"},null,{"$f":"Schema!S32","v":72},{"$f":"LOOKUP(Q31,'Deelnemende landen'!$B$7:$B$38,'Deelnemende landen'!$D$7:$D$38)","v":"Ghana"}]
[null,"Groep D",null,null,null,null,null,null,null,null,null,"Groep H"]
[null,"Wedstrijden",null,null,null,null,null,null,"3 punten voor Toto + 3 bonuspunten voor juiste uitslag",null,null,"Wedstrijden",null,null,null,null,null,null,"3 punten voor Toto + 3 bonuspunten voor juiste uitslag"]
[null,{"$f":"Schema!B36","v":"2014-06-14"},{"$f":"Schema!C36","v":"21:00:00"},{"$f":"Schema!D36","v":40},{"$f":"LOOKUP(D34,'Deelnemende landen'!$B$7:$B$38,'Deelnemende landen'!$D$7:$D$38)","v":"Uruguay"},null,{"$f":"Schema!G36","v":41},{"$f":"LOOKUP(G34,'Deelnemende landen'!$B$7:$B$38,'Deelnemende landen'!$D$7:$D$38)","v":"Costa Rica"},null,null,null,{"$f":"Schema!N36","v":"2014-06-17"},{"$f":"Schema!O36","v":"18:00:00"},{"$f":"Schema!P36","v":80},{"$f":"LOOKUP(N34,'Deelnemende landen'!$B$7:$B$38,'Deelnemende landen'!$D$7:$D$38)","v":"België"},null,{"$f":"Schema!S36","v":81},{"$f":"LOOKUP(Q34,'Deelnemende landen'!$B$7:$B$38,'Deelnemende landen'!$D$7:$D$38)","v":"Algerije"}]
[null,{"$f":"Schema!B37","v":"2014-06-14"},{"$f":"Schema!C37","v":"00:00:00"},{"$f":"Schema!D37","v":42},{"$f":"LOOKUP(D35,'Deelnemende landen'!$B$7:$B$38,'Deelnemende landen'!$D$7:$D$38)","v":"Engeland"},null,{"$f":"Schema!G37","v":43},{"$f":"LOOKUP(G35,'Deelnemende landen'!$B$7:$B$38,'Deelnemende landen'!$D$7:$D$38)","v":"Italië"},null,null,null,{"$f":"Schema!N37","v":"2014-06-17"},{"$f":"Schema!O37","v":"00:00:00"},{"$f":"Schema!P37","v":82},{"$f":"LOOKUP(N35,'Deelnemende landen'!$B$7:$B$38,'Deelnemende landen'!$D$7:$D$38)","v":"Rusland"},null,{"$f":"Schema!S37","v":83},{"$f":"LOOKUP(Q35,'Deelnemende landen'!$B$7:$B$38,'Deelnemende landen'!$D$7:$D$38)","v":"Zuid-Korea"}]
[null,{"$f":"Schema!B38","v":"2014-06-19"},{"$f":"Schema!C38","v":"21:00:00"},{"$f":"Schema!D38","v":40},{"$f":"LOOKUP(D36,'Deelnemende landen'!$B$7:$B$38,'Deelnemende landen'!$D$7:$D$38)","v":"Uruguay"},null,{"$f":"Schema!G38","v":42},{"$f":"LOOKUP(G36,'Deelnemende landen'!$B$7:$B$38,'Deelnemende landen'!$D$7:$D$38)","v":"Engeland"},null,null,null,{"$f":"Schema!N38","v":"2014-06-22"},{"$f":"Schema!O38","v":"18:00:00"},{"$f":"Schema!P38","v":80},{"$f":"LOOKUP(N36,'Deelnemende landen'!$B$7:$B$38,'Deelnemende landen'!$D$7:$D$38)","v":"België"},null,{"$f":"Schema!S38","v":82},{"$f":"LOOKUP(Q36,'Deelnemende landen'!$B$7:$B$38,'Deelnemende landen'!$D$7:$D$38)","v":"Rusland"}]
[null,{"$f":"Schema!B39","v":"2014-06-20"},{"$f":"Schema!C39","v":"18:00:00"},{"$f":"Schema!D39","v":43},{"$f":"LOOKUP(D37,'Deelnemende landen'!$B$7:$B$38,'Deelnemende landen'!$D$7:$D$38)","v":"Italië"},null,{"$f":"Schema!G39","v":41},{"$f":"LOOKUP(G37,'Deelnemende landen'!$B$7:$B$38,'Deelnemende landen'!$D$7:$D$38)","v":"Costa Rica"},null,null,null,{"$f":"Schema!N39","v":"2014-06-22"},{"$f":"Schema!O39","v":"21:00:00"},{"$f":"Schema!P39","v":83},{"$f":"LOOKUP(N37,'Deelnemende landen'!$B$7:$B$38,'Deelnemende landen'!$D$7:$D$38)","v":"Zuid-Korea"},null,{"$f":"Schema!S39","v":81},{"$f":"LOOKUP(Q37,'Deelnemende landen'!$B$7:$B$38,'Deelnemende landen'!$D$7:$D$38)","v":"Algerije"}]
[null,{"$f":"Schema!B40","v":"2014-06-24"},{"$f":"Schema!C40","v":"18:00:00"},{"$f":"Schema!D40","v":43},{"$f":"LOOKUP(D38,'Deelnemende landen'!$B$7:$B$38,'Deelnemende landen'!$D$7:$D$38)","v":"Italië"},null,{"$f":"Schema!G40","v":40},{"$f":"LOOKUP(G38,'Deelnemende landen'!$B$7:$B$38,'Deelnemende landen'!$D$7:$D$38)","v":"Uruguay"},null,null,null,{"$f":"Schema!N40","v":"2014-06-26"},{"$f":"Schema!O40","v":"22:00:00"},{"$f":"Schema!P40","v":83},{"$f":"LOOKUP(N38,'Deelnemende landen'!$B$7:$B$38,'Deelnemende landen'!$D$7:$D$38)","v":"Zuid-Korea"},null,{"$f":"Schema!S40","v":80},{"$f":"LOOKUP(Q38,'Deelnemende landen'!$B$7:$B$38,'Deelnemende landen'!$D$7:$D$38)","v":"België"}]
[null,{"$f":"Schema!B41","v":"2014-06-24"},{"$f":"Schema!C41","v":"18:00:00"},{"$f":"Schema!D41","v":41},{"$f":"LOOKUP(D39,'Deelnemende landen'!$B$7:$B$38,'Deelnemende landen'!$D$7:$D$38)","v":"Costa Rica"},null,{"$f":"Schema!G41","v":42},{"$f":"LOOKUP(G39,'Deelnemende landen'!$B$7:$B$38,'Deelnemende landen'!$D$7:$D$38)","v":"Engeland"},null,null,null,{"$f":"Schema!N41","v":"2014-06-26"},{"$f":"Schema!O41","v":"22:00:00"},{"$f":"Schema!P41","v":81},{"$f":"LOOKUP(N39,'Deelnemende landen'!$B$7:$B$38,'Deelnemende landen'!$D$7:$D$38)","v":"Algerije"},null,{"$f":"Schema!S41","v":82},{"$f":"LOOKUP(Q39,'Deelnemende landen'!$B$7:$B$38,'Deelnemende landen'!$D$7:$D$38)","v":"Rusland"}]
[]
[{"$f":"'Deelnemende landen'!G3","v":"1/8 finales"},null,null,"Achtstefinalisten: juiste voorspelling land (hoeft niet op juiste positie te staan)",null,null,null,null,null,null,null,null,null," = ","5 punten"]
[null,{"$f":"'Deelnemende landen'!G4","v":"1/8 finalist"},null,null,null,null,null,null,"5 PUNTEN per juist voorspeld land",null,null,{"$f":"'Deelnemende landen'!G4","v":"1/8 finalist"},null,null,null,null,null,null,"5 PUNTEN per juist voorspeld land"]
[null,"A1",null,null,{"$f":"IF(D43=\"\",\"\",LOOKUP(D43,'Deelnemende landen'!$B$7:$B$38,'Deelnemende landen'!$D$7:$D$38))","v":""},null,null,null,null,null,null,"E1",null,null,{"$f":"IF(N43=\"\",\"\",LOOKUP(N43,'Deelnemende landen'!$B$7:$B$38,'Deelnemende landen'!$D$7:$D$38))","v":""}]
[null,"A2",null,null,{"$f":"IF(D44=\"\",\"\",LOOKUP(D44,'Deelnemende landen'!$B$7:$B$38,'Deelnemende landen'!$D$7:$D$38))","v":""},null,null,null,null,null,null,"E2",null,null,{"$f":"IF(N44=\"\",\"\",LOOKUP(N44,'Deelnemende landen'!$B$7:$B$38,'Deelnemende landen'!$D$7:$D$38))","v":""}]
[null,"B1",null,null,{"$f":"IF(D45=\"\",\"\",LOOKUP(D45,'Deelnemende landen'!$B$7:$B$38,'Deelnemende landen'!$D$7:$D$38))","v":""},null,null,null,null,null,null,"F1",null,null,{"$f":"IF(N45=\"\",\"\",LOOKUP(N45,'Deelnemende landen'!$B$7:$B$38,'Deelnemende landen'!$D$7:$D$38))","v":""}]
[null,"B2",null,null,{"$f":"IF(D46=\"\",\"\",LOOKUP(D46,'Deelnemende landen'!$B$7:$B$38,'Deelnemende landen'!$D$7:$D$38))","v":""},null,null,null,null,null,null,"F2",null,null,{"$f":"IF(N46=\"\",\"\",LOOKUP(N46,'Deelnemende landen'!$B$7:$B$38,'Deelnemende landen'!$D$7:$D$38))","v":""}]
[null,"C1",null,null,{"$f":"IF(D47=\"\",\"\",LOOKUP(D47,'Deelnemende landen'!$B$7:$B$38,'Deelnemende landen'!$D$7:$D$38))","v":""},null,null,null,null,null,null,"G1",null,null,{"$f":"IF(N47=\"\",\"\",LOOKUP(N47,'Deelnemende landen'!$B$7:$B$38,'Deelnemende landen'!$D$7:$D$38))","v":""}]
[null,"C2",null,null,{"$f":"IF(D48=\"\",\"\",LOOKUP(D48,'Deelnemende landen'!$B$7:$B$38,'Deelnemende landen'!$D$7:$D$38))","v":""},null,null,null,null,null,null,"G2",null,null,{"$f":"IF(N48=\"\",\"\",LOOKUP(N48,'Deelnemende landen'!$B$7:$B$38,'Deelnemende landen'!$D$7:$D$38))","v":""}]
[null,"D1",null,null,{"$f":"IF(D49=\"\",\"\",LOOKUP(D49,'Deelnemende landen'!$B$7:$B$38,'Deelnemende landen'!$D$7:$D$38))","v":""},null,null,null,null,null,null,"H1",null,null,{"$f":"IF(N49=\"\",\"\",LOOKUP(N49,'Deelnemende landen'!$B$7:$B$38,'Deelnemende landen'!$D$7:$D$38))","v":""}]
[null,"D2",null,null,{"$f":"IF(D50=\"\",\"\",LOOKUP(D50,'Deelnemende landen'!$B$7:$B$38,'Deelnemende landen'!$D$7:$D$38))","v":""},null,null,null,null,null,null,"H2",null,null,{"$f":"IF(N50=\"\",\"\",LOOKUP(N50,'Deelnemende landen'!$B$7:$B$38,'Deelnemende landen'!$D$7:$D$38))","v":""}]
[]
[null,"Wedstrijden",null,null,null,null,null,null,null,null,null,"Uitslag na afloop van de reguliere speeltijd van 2x3 kwartier."]
[49,{"$f":"Schema!B60","v":"2014-06-28"},{"$f":"Schema!C60","v":"18:00:00"},1,{"$f":"E43","v":""},null,2,{"$f":"E46","v":""},null,null,null,"Achtstefinalisten: juiste positie en juiste uitslag",null,null,null,null," = ","3 punten extra"]
[50,{"$f":"Schema!B61","v":"2014-06-28"},{"$f":"Schema!C61","v":"22:00:00"},1,{"$f":"E47","v":""},null,2,{"$f":"E50","v":""},null,null,null,"Achtstefinalisten: juiste positie en juiste uitslag",null,null,null,null," = ","3 punten extra"]
[51,{"$f":"Schema!B62","v":"2014-06-29"},{"$f":"Schema!C62","v":"18:00:00"},1,{"$f":"E45","v":""},null,2,{"$f":"E44","v":""},null,null,null,"Achtstefinalisten: juiste positie en juiste uitslag",null,null,null,null," = ","3 punten extra"]
[52,{"$f":"Schema!B63","v":"2014-06-29"},{"$f":"Schema!C63","v":"22:00:00"},1,{"$f":"E49","v":""},null,2,{"$f":"E48","v":""},null,null,null,"Achtstefinalisten: juiste positie en juiste uitslag",null,null,null,null," = ","3 punten extra"]
[53,{"$f":"Schema!B64","v":"2014-06-30"},{"$f":"Schema!C64","v":"18:00:00"},1,{"$f":"O43","v":""},null,2,{"$f":"O46","v":""},null,null,null,"Achtstefinalisten: juiste positie en juiste uitslag",null,null,null,null," = ","3 punten extra"]
[54,{"$f":"Schema!B65","v":"2014-06-30"},{"$f":"Schema!C65","v":"22:00:00"},1,{"$f":"O47","v":""},null,2,{"$f":"O50","v":""},null,null,null,"Achtstefinalisten: juiste positie en juiste uitslag",null,null,null,null," = ","3 punten extra"]
[55,{"$f":"Schema!B66","v":"2014-07-01"},{"$f":"Schema!C66","v":"18:00:00"},1,{"$f":"O45","v":""},null,2,{"$f":"O44","v":""},null,null,null,"Achtstefinalisten: juiste positie en juiste uitslag",null,null,null,null," = ","3 punten extra"]
[56,{"$f":"Schema!B67","v":"2014-07-01"},{"$f":"Schema!C67","v":"22:00:00"},1,{"$f":"O49","v":""},null,2,{"$f":"O48","v":""},null,null,null,"Achtstefinalisten: juiste positie en juiste uitslag",null,null,null,null," = ","3 punten extra"]
[]
[{"$f":"'Deelnemende landen'!I3","v":"1/4 finales"},null,null,"Nummer van de winnaar invullen (1 of 2)"]
[null,{"$f":"'Deelnemende landen'!I4","v":"1/4 finalist"},null,null,null,null,null,null,"5 PUNTEN per juist voorspeld land"]
[null,"Winnaar 49",null,null,{"$f":"IF($D64=\"\",\"\",IF($D64=$D53,$E53,IF($D64=$G53,$H53,\"Fout\")))","v":""},null,null,null,null,null,null,"Toto invullen"]
[null,"Winnaar 50",null,null,{"$f":"IF($D65=\"\",\"\",IF($D65=$D54,$E54,IF($D65=$G54,$H54,\"Fout\")))","v":""},null,null,null,null,null,null,"Toto invullen"]
[null,"Winnaar 51",null,null,"",null,null,null,null,null,null,"Toto invullen"]
[null,"Winnaar 52",null,null,"",null,null,null,null,null,null,"Toto invullen"]
[null,"Winnaar 53",null,null,"",null,null,null,null,null,null,"Toto invullen"]
[null,"Winnaar 54",null,null,"",null,null,null,null,null,null,"Toto invullen"]
[null,"Winnaar 55",null,null,"",null,null,null,null,null,null,"Toto invullen"]
[null,"Winnaar 56",null,null,"",null,null,null,null,null,null,"Toto invullen"]
[]
[null,"Wedstrijden",null,null,null,null,null,null,null,null,null,"Uitslag na afloop van de reguliere speeltijd van 2x3 kwartier."]
[57,{"$f":"Schema!B83","v":"2014-07-04"},{"$f":"Schema!C83","v":"18:00:00"},1,{"$f":"E68","v":""},null,2,{"$f":"E69","v":""},null,null,null,"Kwartfinalisten: juiste positie en juiste uitslag",null,null,null,null," = ","3 punten extra"]
[58,{"$f":"Schema!B84","v":"2014-07-04"},{"$f":"Schema!C84","v":"22:00:00"},1,{"$f":"E64","v":""},null,2,{"$f":"E65","v":""},null,null,null,"Kwartfinalisten: juiste positie en juiste uitslag",null,null,null,null," = ","3 punten extra"]
[59,{"$f":"Schema!B85","v":"2014-07-05"},{"$f":"Schema!C85","v":"18:00:00"},1,{"$f":"E70","v":""},null,2,{"$f":"E71","v":""},null,null,null,"Kwartfinalisten: juiste positie en juiste uitslag",null,null,null,null," = ","3 punten extra"]
[60,{"$f":"Schema!B86","v":"2014-07-05"},{"$f":"Schema!C86","v":"22:00:00"},1,{"$f":"E66","v":""},null,2,{"$f":"E67","v":""},null,null,null,"Kwartfinalisten: juiste positie en juiste uitslag",null,null,null,null," = ","3 punten extra"]
[]
[{"$f":"'Deelnemende landen'!J3","v":"Halve finales"},null,null,"Nummer van de winnaar invullen (1 of 2)"]
[null,{"$f":"'Deelnemende landen'!J4","v":"Halve finalist"},null,null,null,null,null,null,"5 PUNTEN per juist voorspeld land"]
[null,"Winnaar 57",null,null,{"$f":"IF($D$81=\"\",\"\",IF($D$81=$D74,$E74,IF($D$81=$G74,$H74,\"Fout\")))","v":""},null,null,null,null,null,null,"Toto invullen"]
[null,"Winnaar 58",null,null,{"$f":"IF($D82=\"\",\"\",IF($D82=$D75,$E75,IF($D82=$G75,$H75,\"Fout\")))","v":""},null,null,null,null,null,null,"Toto invullen"]
[null,"Winnaar 59",null,null,{"$f":"IF($D83=\"\",\"\",IF($D83=$D76,$E76,IF($D83=$G76,$H76,\"Fout\")))","v":""},null,null,null,null,null,null,"Toto invullen"]
[null,"Winnaar 60",null,null,{"$f":"IF($D84=\"\",\"\",IF($D84=$D77,$E77,IF($D84=$G77,$H77,\"Fout\")))","v":""},null,null,null,null,null,null,"Toto invullen"]
[]
[null,"Wedstrijden",null,null,null,null,null,null,null,null,null,"Uitslag na afloop van de reguliere speeltijd van 2x3 kwartier."]
[61,{"$f":"Schema!B98","v":"2014-07-08"},{"$f":"Schema!C98","v":"22:00:00"},1,{"$f":"E82","v":""},null,2,{"$f":"E81","v":""},null,null,null,"Halvefinalisten: juiste positie en juiste uitslag",null,null,null,null," = ","3 punten extra"]
[62,{"$f":"Schema!B99","v":"2014-07-09"},{"$f":"Schema!C99","v":"22:00:00"},1,{"$f":"E84","v":""},null,2,{"$f":"E83","v":""},null,null,null,"Halvefinalisten: juiste positie en juiste uitslag",null,null,null,null," = ","3 punten extra"]
[]
[{"$f":"'Deelnemende landen'!L3","v":"Finales"},null,null,"Nummer van de winnaar invullen (1 of 2)"]
[null,{"$f":"'Deelnemende landen'!L4","v":"Finalist"},null,null,null,null,null,null,"5 PUNTEN per juist voorspeld land"]
[null,"Winnaar 61",null,null,{"$f":"IF($D92=\"\",\"\",IF($D92=$D87,$E87,IF($D92=$G87,$H87,\"Fout\")))","v":""},null,null,{"$f":"IF($D92=\"\",\"\",IF($D92=$D87,$H87,IF($D92=$G87,$E87,\"Fout\")))","v":""},null,null,null,"Toto invullen"]
[null,"Winnaar 62",null,null,{"$f":"IF($D93=\"\",\"\",IF($D93=$D88,$E88,IF($D93=$G88,$H88,\"Fout\")))","v":""},null,null,{"$f":"IF($D93=\"\",\"\",IF($D93=$D88,$H88,IF($D93=$G88,$E88,\"Fout\")))","v":""},null,null,null,"Toto invullen"]
[]
[null,"Wedstrijden",null,null,null,null,null,null,null,null,null,"Uitslag na afloop van de reguliere speeltijd van 2x3 kwartier."]
[63,{"$f":"Schema!B109","v":"2014-07-12"},{"$f":"Schema!C109","v":"22:00:00"},1,{"$f":"H92","v":""},null,2,{"$f":"H93","v":""},null,null,null,"Finalisten: juiste positie en juiste uitslag",null,null,null,null," = ","3 punten extra"]
[]
[null,"Wedstrijden",null,null,null,null,null,null,null,null,null,"Uitslag na afloop van de reguliere speeltijd van 2x3 kwartier."]
[64,{"$f":"Schema!B112","v":"2014-07-13"},{"$f":"Schema!C112","v":"21:00:00"},1,{"$f":"E92","v":""},null,2,{"$f":"E93","v":""},null,null,null,"Finalisten: juiste positie en juiste uitslag",null,null,null,null," = ","3 punten extra"]
[]
[null,{"$f":"'Deelnemende landen'!E1","v":"Wereldkampioen"},null,null,"10 PUNTEN",null,null,{"$f":"IF($G101=\"\",\"\",IF($G101=D99,E99,IF($G101=G99,H99,\"Fout\")))","v":""},null,null,null,"Toto invullen"]

{"sheet":"Schema","index":1,"n_rows":114,"n_cols":49,"rows_kept":114,"cut":false,"hidden":true,"merged":[]}
[{"$f":"'Deelnemende landen'!H1","v":"Speelschema WK 2014"},null,null,null,null,null,null,null,null,null,null,null,null,null,null,null,null,null,null,null,null,null,null,null,null,null,null,null,null,null,null,null,null,null,null,null,null,null,null,null,null,null,null,null,null,null,null,null,"15:00:00"]
[null,null,null,null,null,null,null,null,null,null,null,null,null,null,null,null,null,null,null,null,null,null,null,null,null,null,null,null,null,null,null,null,null,null,null,null,null,null,null,null,null,null,null,null,null,null,null,null,"16:00:00"]
[null,null,null,null,null,null,null,null,null,null,null,null,null,null,null,null,null,null,null,null,null,null,null,null,null,null,null,null,null,null,null,null,null,null,null,null,null,null,null,null,null,null,null,null,null,null,null,null,"18:00:00"]
[null,null,null,null,null,null,null,null,null,null,null,null,null,null,null,null,null,null,null,null,null,null,null,null,null,null,null,null,null,null,null,null,null,null,null,null,null,null,null,null,null,null,null,null,null,null,null,null,"21:00:00"]
[]
["Groepswedstrijden"]
[null,"Groep A",null,null,null,null,null,null,null,null,null,null,null,"Groep E"]
[null,"Wedstrijden",null,null,null,null,null,null,null,"Gevolg",null,null,null,"Wedstrijden",null,null,null,null,null,null,null,"Gevolg"]
[1,{"$f":"VLOOKUP(A9,fifaschema!A$2:C$65,2,FALSE)","v":"2014-06-12"},{"$f":"VLOOKUP(A9,fifaschema!A$2:C$65,3,FALSE)","v":"22:00:00"},{"$f":"VLOOKUP(A9,fifaschema!$A$2:$H$49,5,FALSE)","v":10},{"$f":"LOOKUP(D9,'Deelnemende landen'!$B$7:$B$38,'Deelnemende landen'!$D$7:$D$38)","v":"Brazilië"},null,{"$f":"VLOOKUP(A9,fifaschema!$A$2:$H$49,7,FALSE)","v":11},{"$f":"LOOKUP(G9,'Deelnemende landen'!$B$7:$B$38,'Deelnemende landen'!$D$7:$D$38)","v":"Kroatië"},null,{"$f":"IF(F9>I9,1,IF(I9>F9,2,IF(F9=\"\",\"\",3)))","v":""},null,null,9,{"$f":"VLOOKUP(M9,fifaschema!A$2:C$65,2,FALSE)","v":"2014-06-15"},{"$f":"VLOOKUP(M9,fifaschema!A$2:C$65,3,FALSE)","v":"18:00:00"},{"$f":"VLOOKUP(M9,fifaschema!$A$2:$H$49,5,FALSE)","v":50},{"$f":"LOOKUP(P9,'Deelnemende landen'!$B$7:$B$38,'Deelnemende landen'!$D$7:$D$38)","v":"Zwitserland"},null,{"$f":"VLOOKUP(M9,fifaschema!$A$2:$H$49,7,FALSE)","v":51},{"$f":"LOOKUP(S9,'Deelnemende landen'!$B$7:$B$38,'Deelnemende landen'!$D$7:$D$38)","v":"Ecuador"},null,{"$f":"IF(R9>U9,1,IF(U9>R9,2,IF(R9=\"\",\"\",3)))","v":""}]
[2,{"$f":"VLOOKUP(A10,fifaschema!A$2:C$65,2,FALSE)","v":"2014-06-13"},{"$f":"VLOOKUP(A10,fifaschema!A$2:C$65,3,FALSE)","v":"18:00:00"},{"$f":"VLOOKUP(A10,fifaschema!$A$2:$H$49,5,FALSE)","v":12},{"$f":"LOOKUP(D10,'Deelnemende landen'!$B$7:$B$38,'Deelnemende landen'!$D$7:$D$38)","v":"Mexico"},null,{"$f":"VLOOKUP(A10,fifaschema!$A$2:$H$49,7,FALSE)","v":13},{"$f":"LOOKUP(G10,'Deelnemende landen'!$B$7:$B$38,'Deelnemende landen'!$D$7:$D$38)","v":"Kameroen"},null,"",null,null,10,{"$f":"VLOOKUP(M10,fifaschema!A$2:C$65,2,FALSE)","v":"2014-06-15"},{"$f":"VLOOKUP(M10,fifaschema!A$2:C$65,3,FALSE)","v":"21:00:00"},{"$f":"VLOOKUP(M10,fifaschema!$A$2:$H$49,5,FALSE)","v":52},{"$f":"LOOKUP(P10,'Deelnemende landen'!$B$7:$B$38,'Deelnemende landen'!$D$7:$D$38)","v":"Frankrijk"},null,{"$f":"VLOOKUP(M10,fifaschema!$A$2:$H$49,7,FALSE)","v":53},{"$f":"LOOKUP(S10,'Deelnemende landen'!$B$7:$B$38,'Deelnemende landen'!$D$7:$D$38)","v":"Honduras"},null,""]
[17,{"$f":"VLOOKUP(A11,fifaschema!A$2:C$65,2,FALSE)","v":"2014-06-17"},{"$f":"VLOOKUP(A11,fifaschema!A$2:C$65,3,FALSE)","v":"21:00:00"},{"$f":"VLOOKUP(A11,fifaschema!$A$2:$H$49,5,FALSE)","v":10},{"$f":"LOOKUP(D11,'Deelnemende landen'!$B$7:$B$38,'Deelnemende landen'!$D$7:$D$38)","v":"Brazilië"},null,{"$f":"VLOOKUP(A11,fifaschema!$A$2:$H$49,7,FALSE)","v":12},{"$f":"LOOKUP(G11,'Deelnemende landen'!$B$7:$B$38,'Deelnemende landen'!$D$7:$D$38)","v":"Mexico"},null,"",null,null,25,{"$f":"VLOOKUP(M11,fifaschema!A$2:C$65,2,FALSE)","v":"2014-06-20"},{"$f":"VLOOKUP(M11,fifaschema!A$2:C$65,3,FALSE)","v":"21:00:00"},{"$f":"VLOOKUP(M11,fifaschema!$A$2:$H$49,5,FALSE)","v":50},{"$f":"LOOKUP(P11,'Deelnemende landen'!$B$7:$B$38,'Deelnemende landen'!$D$7:$D$38)","v":"Zwitserland"},null,{"$f":"VLOOKUP(M11,fifaschema!$A$2:$H$49,7,FALSE)","v":52},{"$f":"LOOKUP(S11,'Deelnemende landen'!$B$7:$B$38,'Deelnemende landen'!$D$7:$D$38)","v":"Frankrijk"},null,""]
[18,{"$f":"VLOOKUP(A12,fifaschema!A$2:C$65,2,FALSE)","v":"2014-06-18"},{"$f":"VLOOKUP(A12,fifaschema!A$2:C$65,3,FALSE)","v":"00:00:00"},{"$f":"VLOOKUP(A12,fifaschema!$A$2:$H$49,5,FALSE)","v":13},{"$f":"LOOKUP(D12,'Deelnemende landen'!$B$7:$B$38,'Deelnemende landen'!$D$7:$D$38)","v":"Kameroen"},null,{"$f":"VLOOKUP(A12,fifaschema!$A$2:$H$49,7,FALSE)","v":11},{"$f":"LOOKUP(G12,'Deelnemende landen'!$B$7:$B$38,'Deelnemende landen'!$D$7:$D$38)","v":"Kroatië"},null,"",null,null,26,{"$f":"VLOOKUP(M12,fifaschema!A$2:C$65,2,FALSE)","v":"2014-06-20"},{"$f":"VLOOKUP(M12,fifaschema!A$2:C$65,3,FALSE)","v":"00:00:00"},{"$f":"VLOOKUP(M12,fifaschema!$A$2:$H$49,5,FALSE)","v":53},{"$f":"LOOKUP(P12,'Deelnemende landen'!$B$7:$B$38,'Deelnemende landen'!$D$7:$D$38)","v":"Honduras"},null,{"$f":"VLOOKUP(M12,fifaschema!$A$2:$H$49,7,FALSE)","v":51},{"$f":"LOOKUP(S12,'Deelnemende landen'!$B$7:$B$38,'Deelnemende landen'!$D$7:$D$38)","v":"Ecuador"},null,""]
[33,{"$f":"VLOOKUP(A13,fifaschema!A$2:C$65,2,FALSE)","v":"2014-06-23"},{"$f":"VLOOKUP(A13,fifaschema!A$2:C$65,3,FALSE)","v":"22:00:00"},{"$f":"VLOOKUP(A13,fifaschema!$A$2:$H$49,5,FALSE)","v":13},{"$f":"LOOKUP(D13,'Deelnemende landen'!$B$7:$B$38,'Deelnemende landen'!$D$7:$D$38)","v":"Kameroen"},null,{"$f":"VLOOKUP(A13,fifaschema!$A$2:$H$49,7,FALSE)","v":10},{"$f":"LOOKUP(G13,'Deelnemende landen'!$B$7:$B$38,'Deelnemende landen'!$D$7:$D$38)","v":"Brazilië"},null,"",null,null,41,{"$f":"VLOOKUP(M13,fifaschema!A$2:C$65,2,FALSE)","v":"2014-06-25"},{"$f":"VLOOKUP(M13,fifaschema!A$2:C$65,3,FALSE)","v":"22:00:00"},{"$f":"VLOOKUP(M13,fifaschema!$A$2:$H$49,5,FALSE)","v":53},{"$f":"LOOKUP(P13,'Deelnemende landen'!$B$7:$B$38,'Deelnemende landen'!$D$7:$D$38)","v":"Honduras"},null,{"$f":"VLOOKUP(M13,fifaschema!$A$2:$H$49,7,FALSE)","v":50},{"$f":"LOOKUP(S13,'Deelnemende landen'!$B$7:$B$38,'Deelnemende landen'!$D$7:$D$38)","v":"Zwitserland"},null,""]
[34,{"$f":"VLOOKUP(A14,fifaschema!A$2:C$65,2,FALSE)","v":"2014-06-23"},{"$f":"VLOOKUP(A14,fifaschema!A$2:C$65,3,FALSE)","v":"22:00:00"},{"$f":"VLOOKUP(A14,fifaschema!$A$2:$H$49,5,FALSE)","v":11},{"$f":"LOOKUP(D14,'Deelnemende landen'!$B$7:$B$38,'Deelnemende landen'!$D$7:$D$38)","v":"Kroatië"},null,{"$f":"VLOOKUP(A14,fifaschema!$A$2:$H$49,7,FALSE)","v":12},{"$f":"LOOKUP(G14,'Deelnemende landen'!$B$7:$B$38,'Deelnemende landen'!$D$7:$D$38)","v":"Mexico"},null,"",null,null,42,{"$f":"VLOOKUP(M14,fifaschema!A$2:C$65,2,FALSE)","v":"2014-06-25"},{"$f":"VLOOKUP(M14,fifaschema!A$2:C$65,3,FALSE)","v":"22:00:00"},{"$f":"VLOOKUP(M14,fifaschema!$A$2:$H$49,5,FALSE)","v":51},{"$f":"LOOKUP(P14,'Deelnemende landen'!$B$7:$B$38,'Deelnemende landen'!$D$7:$D$38)","v":"Ecuador"},null,{"$f":"VLOOKUP(M14,fifaschema!$A$2:$H$49,7,FALSE)","v":52},{"$f":"LOOKUP(S14,'Deelnemende landen'!$B$7:$B$38,'Deelnemende landen'!$D$7:$D$38)","v":"Frankrijk"},null,""]
[]
[null,"Groep B",null,null,null,null,null,null,null,null,null,null,null,"Groep F"]
[null,"Wedstrijden",null,null,null,null,null,null,null,"Gevolg",null,null,null,"Wedstrijden",null,null,null,null,null,null,null,"Gevolg"]
[3,{"$f":"VLOOKUP(A18,fifaschema!A$2:C$65,2,FALSE)","v":"2014-06-13"},{"$f":"VLOOKUP(A18,fifaschema!A$2:C$65,3,FALSE)","v":"21:00:00"},{"$f":"VLOOKUP(A18,fifaschema!$A$2:$H$49,5,FALSE)","v":20},{"$f":"LOOKUP(D18,'Deelnemende landen'!$B$7:$B$38,'Deelnemende landen'!$D$7:$D$38)","v":"Spanje"},null,{"$f":"VLOOKUP(A18,fifaschema!$A$2:$H$49,7,FALSE)","v":21},{"$f":"LOOKUP(G18,'Deelnemende landen'!$B$7:$B$38,'Deelnemende landen'!$D$7:$D$38)","v":"Nederland"},null,{"$f":"IF(F18>I18,1,IF(I18>F18,2,IF(F18=\"\",\"\",3)))","v":""},null,null,11,{"$f":"VLOOKUP(M18,fifaschema!A$2:C$65,2,FALSE)","v":"2014-06-15"},{"$f":"VLOOKUP(M18,fifaschema!A$2:C$65,3,FALSE)","v":"00:00:00"},{"$f":"VLOOKUP(M18,fifaschema!$A$2:$H$49,5,FALSE)","v":60},{"$f":"LOOKUP(P18,'Deelnemende landen'!$B$7:$B$38,'Deelnemende landen'!$D$7:$D$38)","v":"Argentinië"},null,{"$f":"VLOOKUP(M18,fifaschema!$A$2:$H$49,7,FALSE)","v":61},{"$f":"LOOKUP(S18,'Deelnemende landen'!$B$7:$B$38,'Deelnemende landen'!$D$7:$D$38)","v":"Bosnië Herzegovina"},null,{"$f":"IF(R18>U18,1,IF(U18>R18,2,IF(R18=\"\",\"\",3)))","v":""}]
[4,{"$f":"VLOOKUP(A19,fifaschema!A$2:C$65,2,FALSE)","v":"2014-06-13"},{"$f":"VLOOKUP(A19,fifaschema!A$2:C$65,3,FALSE)","v":"00:00:00"},{"$f":"VLOOKUP(A19,fifaschema!$A$2:$H$49,5,FALSE)","v":22},{"$f":"LOOKUP(D19,'Deelnemende landen'!$B$7:$B$38,'Deelnemende landen'!$D$7:$D$38)","v":"Chili"},null,{"$f":"VLOOKUP(A19,fifaschema!$A$2:$H$49,7,FALSE)","v":23},{"$f":"LOOKUP(G19,'Deelnemende landen'!$B$7:$B$38,'Deelnemende landen'!$D$7:$D$38)","v":"Australië"},null,"",null,null,12,{"$f":"VLOOKUP(M19,fifaschema!A$2:C$65,2,FALSE)","v":"2014-06-16"},{"$f":"VLOOKUP(M19,fifaschema!A$2:C$65,3,FALSE)","v":"21:00:00"},{"$f":"VLOOKUP(M19,fifaschema!$A$2:$H$49,5,FALSE)","v":62},{"$f":"LOOKUP(P19,'Deelnemende landen'!$B$7:$B$38,'Deelnemende landen'!$D$7:$D$38)","v":"Iran"},null,{"$f":"VLOOKUP(M19,fifaschema!$A$2:$H$49,7,FALSE)","v":63},{"$f":"LOOKUP(S19,'Deelnemende landen'!$B$7:$B$38,'Deelnemende landen'!$D$7:$D$38)","v":"Nigeria"},null,""]
[19,{"$f":"VLOOKUP(A20,fifaschema!A$2:C$65,2,FALSE)","v":"2014-06-18"},{"$f":"VLOOKUP(A20,fifaschema!A$2:C$65,3,FALSE)","v":"21:00:00"},{"$f":"VLOOKUP(A20,fifaschema!$A$2:$H$49,5,FALSE)","v":20},{"$f":"LOOKUP(D20,'Deelnemende landen'!$B$7:$B$38,'Deelnemende landen'!$D$7:$D$38)","v":"Spanje"},null,{"$f":"VLOOKUP(A20,fifaschema!$A$2:$H$49,7,FALSE)","v":22},{"$f":"LOOKUP(G20,'Deelnemende landen'!$B$7:$B$38,'Deelnemende landen'!$D$7:$D$38)","v":"Chili"},null,"",null,null,27,{"$f":"VLOOKUP(M20,fifaschema!A$2:C$65,2,FALSE)","v":"2014-06-21"},{"$f":"VLOOKUP(M20,fifaschema!A$2:C$65,3,FALSE)","v":"18:00:00"},{"$f":"VLOOKUP(M20,fifaschema!$A$2:$H$49,5,FALSE)","v":60},{"$f":"LOOKUP(P20,'Deelnemende landen'!$B$7:$B$38,'Deelnemende landen'!$D$7:$D$38)","v":"Argentinië"},null,{"$f":"VLOOKUP(M20,fifaschema!$A$2:$H$49,7,FALSE)","v":62},{"$f":"LOOKUP(S20,'Deelnemende landen'!$B$7:$B$38,'Deelnemende landen'!$D$7:$D$38)","v":"Iran"},null,""]
[20,{"$f":"VLOOKUP(A21,fifaschema!A$2:C$65,2,FALSE)","v":"2014-06-18"},{"$f":"VLOOKUP(A21,fifaschema!A$2:C$65,3,FALSE)","v":"18:00:00"},{"$f":"VLOOKUP(A21,fifaschema!$A$2:$H$49,5,FALSE)","v":23},{"$f":"LOOKUP(D21,'Deelnemende landen'!$B$7:$B$38,'Deelnemende landen'!$D$7:$D$38)","v":"Australië"},null,{"$f":"VLOOKUP(A21,fifaschema!$A$2:$H$49,7,FALSE)","v":21},{"$f":"LOOKUP(G21,'Deelnemende landen'!$B$7:$B$38,'Deelnemende landen'!$D$7:$D$38)","v":"Nederland"},null,"",null,null,28,{"$f":"VLOOKUP(M21,fifaschema!A$2:C$65,2,FALSE)","v":"2014-06-21"},{"$f":"VLOOKUP(M21,fifaschema!A$2:C$65,3,FALSE)","v":"00:00:00"},{"$f":"VLOOKUP(M21,fifaschema!$A$2:$H$49,5,FALSE)","v":63},{"$f":"LOOKUP(P21,'Deelnemende landen'!$B$7:$B$38,'Deelnemende landen'!$D$7:$D$38)","v":"Nigeria"},null,{"$f":"VLOOKUP(M21,fifaschema!$A$2:$H$49,7,FALSE)","v":61},{"$f":"LOOKUP(S21,'Deelnemende landen'!$B$7:$B$38,'Deelnemende landen'!$D$7:$D$38)","v":"Bosnië Herzegovina"},null,""]
[35,{"$f":"VLOOKUP(A22,fifaschema!A$2:C$65,2,FALSE)","v":"2014-06-23"},{"$f":"VLOOKUP(A22,fifaschema!A$2:C$65,3,FALSE)","v":"18:00:00"},{"$f":"VLOOKUP(A22,fifaschema!$A$2:$H$49,5,FALSE)","v":23},{"$f":"LOOKUP(D22,'Deelnemende landen'!$B$7:$B$38,'Deelnemende landen'!$D$7:$D$38)","v":"Australië"},null,{"$f":"VLOOKUP(A22,fifaschema!$A$2:$H$49,7,FALSE)","v":20},{"$f":"LOOKUP(G22,'Deelnemende landen'!$B$7:$B$38,'Deelnemende landen'!$D$7:$D$38)","v":"Spanje"},null,"",null,null,43,{"$f":"VLOOKUP(M22,fifaschema!A$2:C$65,2,FALSE)","v":"2014-06-25"},{"$f":"VLOOKUP(M22,fifaschema!A$2:C$65,3,FALSE)","v":"18:00:00"},{"$f":"VLOOKUP(M22,fifaschema!$A$2:$H$49,5,FALSE)","v":63},{"$f":"LOOKUP(P22,'Deelnemende landen'!$B$7:$B$38,'Deelnemende landen'!$D$7:$D$38)","v":"Nigeria"},null,{"$f":"VLOOKUP(M22,fifaschema!$A$2:$H$49,7,FALSE)","v":60},{"$f":"LOOKUP(S22,'Deelnemende landen'!$B$7:$B$38,'Deelnemende landen'!$D$7:$D$38)","v":"Argentinië"},null,""]
[36,{"$f":"VLOOKUP(A23,fifaschema!A$2:C$65,2,FALSE)","v":"2014-06-23"},{"$f":"VLOOKUP(A23,fifaschema!A$2:C$65,3,FALSE)","v":"18:00:00"},{"$f":"VLOOKUP(A23,fifaschema!$A$2:$H$49,5,FALSE)","v":21},{"$f":"LOOKUP(D23,'Deelnemende landen'!$B$7:$B$38,'Deelnemende landen'!$D$7:$D$38)","v":"Nederland"},null,{"$f":"VLOOKUP(A23,fifaschema!$A$2:$H$49,7,FALSE)","v":22},{"$f":"LOOKUP(G23,'Deelnemende landen'!$B$7:$B$38,'Deelnemende landen'!$D$7:$D$38)","v":"Chili"},null,"",null,null,44,{"$f":"VLOOKUP(M23,fifaschema!A$2:C$65,2,FALSE)","v":"2014-06-25"},{"$f":"VLOOKUP(M23,fifaschema!A$2:C$65,3,FALSE)","v":"18:00:00"},{"$f":"VLOOKUP(M23,fifaschema!$A$2:$H$49,5,FALSE)","v":61},{"$f":"LOOKUP(P23,'Deelnemende landen'!$B$7:$B$38,'Deelnemende landen'!$D$7:$D$38)","v":"Bosnië Herzegovina"},null,{"$f":"VLOOKUP(M23,fifaschema!$A$2:$H$49,7,FALSE)","v":62},{"$f":"LOOKUP(S23,'Deelnemende landen'!$B$7:$B$38,'Deelnemende landen'!$D$7:$D$38)","v":"Iran"},null,""]
[]
[null,"Groep C",null,null,null,null,null,null,null,null,null,null,null,"Groep G"]
[null,"Wedstrijden",null,null,null,null,null,null,null,"Gevolg",null,null,null,"Wedstrijden",null,null,null,null,null,null,null,"Gevolg"]
[5,{"$f":"VLOOKUP(A27,fifaschema!A$2:C$65,2,FALSE)","v":"2014-06-14"},{"$f":"VLOOKUP(A27,fifaschema!A$2:C$65,3,FALSE)","v":"18:00:00"},{"$f":"VLOOKUP(A27,fifaschema!$A$2:$H$49,5,FALSE)","v":30},{"$f":"LOOKUP(D27,'Deelnemende landen'!$B$7:$B$38,'Deelnemende landen'!$D$7:$D$38)","v":"Colombia"},null,{"$f":"VLOOKUP(A27,fifaschema!$A$2:$H$49,7,FALSE)","v":31},{"$f":"LOOKUP(G27,'Deelnemende landen'!$B$7:$B$38,'Deelnemende landen'!$D$7:$D$38)","v":"Griekenland"},null,{"$f":"IF(F27>I27,1,IF(I27>F27,2,IF(F27=\"\",\"\",3)))","v":""},null,null,13,{"$f":"VLOOKUP(M27,fifaschema!A$2:C$65,2,FALSE)","v":"2014-06-16"},{"$f":"VLOOKUP(M27,fifaschema!A$2:C$65,3,FALSE)","v":"18:00:00"},{"$f":"VLOOKUP(M27,fifaschema!$A$2:$H$49,5,FALSE)","v":70},{"$f":"LOOKUP(P27,'Deelnemende landen'!$B$7:$B$38,'Deelnemende landen'!$D$7:$D$38)","v":"Duitsland"},null,{"$f":"VLOOKUP(M27,fifaschema!$A$2:$H$49,7,FALSE)","v":71},{"$f":"LOOKUP(S27,'Deelnemende landen'!$B$7:$B$38,'Deelnemende landen'!$D$7:$D$38)","v":"Portugal"},null,{"$f":"IF(R27>U27,1,IF(U27>R27,2,IF(R27=\"\",\"\",3)))","v":""}]
[6,{"$f":"VLOOKUP(A28,fifaschema!A$2:C$65,2,FALSE)","v":"2014-06-14"},{"$f":"VLOOKUP(A28,fifaschema!A$2:C$65,3,FALSE)","v":"03:00:00"},{"$f":"VLOOKUP(A28,fifaschema!$A$2:$H$49,5,FALSE)","v":32},{"$f":"LOOKUP(D28,'Deelnemende landen'!$B$7:$B$38,'Deelnemende landen'!$D$7:$D$38)","v":"Ivoorkust"},null,{"$f":"VLOOKUP(A28,fifaschema!$A$2:$H$49,7,FALSE)","v":33},{"$f":"LOOKUP(G28,'Deelnemende landen'!$B$7:$B$38,'Deelnemende landen'!$D$7:$D$38)","v":"Japan"},null,"",null,null,14,{"$f":"VLOOKUP(M28,fifaschema!A$2:C$65,2,FALSE)","v":"2014-06-16"},{"$f":"VLOOKUP(M28,fifaschema!A$2:C$65,3,FALSE)","v":"00:00:00"},{"$f":"VLOOKUP(M28,fifaschema!$A$2:$H$49,5,FALSE)","v":72},{"$f":"LOOKUP(P28,'Deelnemende landen'!$B$7:$B$38,'Deelnemende landen'!$D$7:$D$38)","v":"Ghana"},null,{"$f":"VLOOKUP(M28,fifaschema!$A$2:$H$49,7,FALSE)","v":73},{"$f":"LOOKUP(S28,'Deelnemende landen'!$B$7:$B$38,'Deelnemende landen'!$D$7:$D$38)","v":"USA"},null,""]
[21,{"$f":"VLOOKUP(A29,fifaschema!A$2:C$65,2,FALSE)","v":"2014-06-19"},{"$f":"VLOOKUP(A29,fifaschema!A$2:C$65,3,FALSE)","v":"18:00:00"},{"$f":"VLOOKUP(A29,fifaschema!$A$2:$H$49,5,FALSE)","v":30},{"$f":"LOOKUP(D29,'Deelnemende landen'!$B$7:$B$38,'Deelnemende landen'!$D$7:$D$38)","v":"Colombia"},null,{"$f":"VLOOKUP(A29,fifaschema!$A$2:$H$49,7,FALSE)","v":32},{"$f":"LOOKUP(G29,'Deelnemende landen'!$B$7:$B$38,'Deelnemende landen'!$D$7:$D$38)","v":"Ivoorkust"},null,"",null,null,29,{"$f":"VLOOKUP(M29,fifaschema!A$2:C$65,2,FALSE)","v":"2014-06-21"},{"$f":"VLOOKUP(M29,fifaschema!A$2:C$65,3,FALSE)","v":"21:00:00"},{"$f":"VLOOKUP(M29,fifaschema!$A$2:$H$49,5,FALSE)","v":70},{"$f":"LOOKUP(P29,'Deelnemende landen'!$B$7:$B$38,'Deelnemende landen'!$D$7:$D$38)","v":"Duitsland"},null,{"$f":"VLOOKUP(M29,fifaschema!$A$2:$H$49,7,FALSE)","v":72},{"$f":"LOOKUP(S29,'Deelnemende landen'!$B$7:$B$38,'Deelnemende landen'!$D$7:$D$38)","v":"Ghana"},null,""]
[22,{"$f":"VLOOKUP(A30,fifaschema!A$2:C$65,2,FALSE)","v":"2014-06-19"},{"$f":"VLOOKUP(A30,fifaschema!A$2:C$65,3,FALSE)","v":"00:00:00"},{"$f":"VLOOKUP(A30,fifaschema!$A$2:$H$49,5,FALSE)","v":33},{"$f":"LOOKUP(D30,'Deelnemende landen'!$B$7:$B$38,'Deelnemende landen'!$D$7:$D$38)","v":"Japan"},null,{"$f":"VLOOKUP(A30,fifaschema!$A$2:$H$49,7,FALSE)","v":31},{"$f":"LOOKUP(G30,'Deelnemende landen'!$B$7:$B$38,'Deelnemende landen'!$D$7:$D$38)","v":"Griekenland"},null,"",null,null,30,{"$f":"VLOOKUP(M30,fifaschema!A$2:C$65,2,FALSE)","v":"2014-06-22"},{"$f":"VLOOKUP(M30,fifaschema!A$2:C$65,3,FALSE)","v":"00:00:00"},{"$f":"VLOOKUP(M30,fifaschema!$A$2:$H$49,5,FALSE)","v":73},{"$f":"LOOKUP(P30,'Deelnemende landen'!$B$7:$B$38,'Deelnemende landen'!$D$7:$D$38)","v":"USA"},null,{"$f":"VLOOKUP(M30,fifaschema!$A$2:$H$49,7,FALSE)","v":71},{"$f":"LOOKUP(S30,'Deelnemende landen'!$B$7:$B$38,'Deelnemende landen'!$D$7:$D$38)","v":"Portugal"},null,""]
[37,{"$f":"VLOOKUP(A31,fifaschema!A$2:C$65,2,FALSE)","v":"2014-06-24"},{"$f":"VLOOKUP(A31,fifaschema!A$2:C$65,3,FALSE)","v":"22:00:00"},{"$f":"VLOOKUP(A31,fifaschema!$A$2:$H$49,5,FALSE)","v":33},{"$f":"LOOKUP(D31,'Deelnemende landen'!$B$7:$B$38,'Deelnemende landen'!$D$7:$D$38)","v":"Japan"},null,{"$f":"VLOOKUP(A31,fifaschema!$A$2:$H$49,7,FALSE)","v":30},{"$f":"LOOKUP(G31,'Deelnemende landen'!$B$7:$B$38,'Deelnemende landen'!$D$7:$D$38)","v":"Colombia"},null,"",null,null,45,{"$f":"VLOOKUP(M31,fifaschema!A$2:C$65,2,FALSE)","v":"2014-06-26"},{"$f":"VLOOKUP(M31,fifaschema!A$2:C$65,3,FALSE)","v":"18:00:00"},{"$f":"VLOOKUP(M31,fifaschema!$A$2:$H$49,5,FALSE)","v":73},{"$f":"LOOKUP(P31,'Deelnemende landen'!$B$7:$B$38,'Deelnemende landen'!$D$7:$D$38)","v":"USA"},null,{"$f":"VLOOKUP(M31,fifaschema!$A$2:$H$49,7,FALSE)","v":70},{"$f":"LOOKUP(S31,'Deelnemende landen'!$B$7:$B$38,'Deelnemende landen'!$D$7:$D$38)","v":"Duitsland"},null,""]
[38,{"$f":"VLOOKUP(A32,fifaschema!A$2:C$65,2,FALSE)","v":"2014-06-24"},{"$f":"VLOOKUP(A32,fifaschema!A$2:C$65,3,FALSE)","v":"22:00:00"},{"$f":"VLOOKUP(A32,fifaschema!$A$2:$H$49,5,FALSE)","v":31},{"$f":"LOOKUP(D32,'Deelnemende landen'!$B$7:$B$38,'Deelnemende landen'!$D$7:$D$38)","v":"Griekenland"},null,{"$f":"VLOOKUP(A32,fifaschema!$A$2:$H$49,7,FALSE)","v":32},{"$f":"LOOKUP(G32,'Deelnemende landen'!$B$7:$B$38,'Deelnemende landen'!$D$7:$D$38)","v":"Ivoorkust"},null,"",null,null,46,{"$f":"VLOOKUP(M32,fifaschema!A$2:C$65,2,FALSE)","v":"2014-06-26"},{"$f":"VLOOKUP(M32,fifaschema!A$2:C$65,3,FALSE)","v":"18:00:00"},{"$f":"VLOOKUP(M32,fifaschema!$A$2:$H$49,5,FALSE)","v":71},{"$f":"LOOKUP(P32,'Deelnemende landen'!$B$7:$B$38,'Deelnemende landen'!$D$7:$D$38)","v":"Portugal"},null,{"$f":"VLOOKUP(M32,fifaschema!$A$2:$H$49,7,FALSE)","v":72},{"$f":"LOOKUP(S32,'Deelnemende landen'!$B$7:$B$38,'Deelnemende landen'!$D$7:$D$38)","v":"Ghana"},null,""]
[]
[null,"Groep D",null,null,null,null,null,null,null,null,null,null,null,"Groep H"]
[null,"Wedstrijden",null,null,null,null,null,null,null,"Gevolg",null,null,null,"Wedstrijden",null,null,null,null,null,null,null,"Gevolg"]
[7,{"$f":"VLOOKUP(A36,fifaschema!A$2:C$65,2,FALSE)","v":"2014-06-14"},{"$f":"VLOOKUP(A36,fifaschema!A$2:C$65,3,FALSE)","v":"21:00:00"},{"$f":"VLOOKUP(A36,fifaschema!$A$2:$H$49,5,FALSE)","v":40},{"$f":"LOOKUP(D36,'Deelnemende landen'!$B$7:$B$38,'Deelnemende landen'!$D$7:$D$38)","v":"Uruguay"},null,{"$f":"VLOOKUP(A36,fifaschema!$A$2:$H$49,7,FALSE)","v":41},{"$f":"LOOKUP(G36,'Deelnemende landen'!$B$7:$B$38,'Deelnemende landen'!$D$7:$D$38)","v":"Costa Rica"},null,{"$f":"IF(F36>I36,1,IF(I36>F36,2,IF(F36=\"\",\"\",3)))","v":""},null,null,15,{"$f":"VLOOKUP(M36,fifaschema!A$2:C$65,2,FALSE)","v":"2014-06-17"},{"$f":"VLOOKUP(M36,fifaschema!A$2:C$65,3,FALSE)","v":"18:00:00"},{"$f":"VLOOKUP(M36,fifaschema!$A$2:$H$49,5,FALSE)","v":80},{"$f":"LOOKUP(P36,'Deelnemende landen'!$B$7:$B$38,'Deelnemende landen'!$D$7:$D$38)","v":"België"},null,{"$f":"VLOOKUP(M36,fifaschema!$A$2:$H$49,7,FALSE)","v":81},{"$f":"LOOKUP(S36,'Deelnemende landen'!$B$7:$B$38,'Deelnemende landen'!$D$7:$D$38)","v":"Algerije"},null,{"$f":"IF(R36>U36,1,IF(U36>R36,2,IF(R36=\"\",\"\",3)))","v":""}]
[8,{"$f":"VLOOKUP(A37,fifaschema!A$2:C$65,2,FALSE)","v":"2014-06-14"},{"$f":"VLOOKUP(A37,fifaschema!A$2:C$65,3,FALSE)","v":"00:00:00"},{"$f":"VLOOKUP(A37,fifaschema!$A$2:$H$49,5,FALSE)","v":42},{"$f":"LOOKUP(D37,'Deelnemende landen'!$B$7:$B$38,'Deelnemende landen'!$D$7:$D$38)","v":"Engeland"},null,{"$f":"VLOOKUP(A37,fifaschema!$A$2:$H$49,7,FALSE)","v":43},{"$f":"LOOKUP(G37,'Deelnemende landen'!$B$7:$B$38,'Deelnemende landen'!$D$7:$D$38)","v":"Italië"},null,"",null,null,16,{"$f":"VLOOKUP(M37,fifaschema!A$2:C$65,2,FALSE)","v":"2014-06-17"},{"$f":"VLOOKUP(M37,fifaschema!A$2:C$65,3,FALSE)","v":"00:00:00"},{"$f":"VLOOKUP(M37,fifaschema!$A$2:$H$49,5,FALSE)","v":82},{"$f":"LOOKUP(P37,'Deelnemende landen'!$B$7:$B$38,'Deelnemende landen'!$D$7:$D$38)","v":"Rusland"},null,{"$f":"VLOOKUP(M37,fifaschema!$A$2:$H$49,7,FALSE)","v":83},{"$f":"LOOKUP(S37,'Deelnemende landen'!$B$7:$B$38,'Deelnemende landen'!$D$7:$D$38)","v":"Zuid-Korea"},null,""]
[23,{"$f":"VLOOKUP(A38,fifaschema!A$2:C$65,2,FALSE)","v":"2014-06-19"},{"$f":"VLOOKUP(A38,fifaschema!A$2:C$65,3,FALSE)","v":"21:00:00"},{"$f":"VLOOKUP(A38,fifaschema!$A$2:$H$49,5,FALSE)","v":40},{"$f":"LOOKUP(D38,'Deelnemende landen'!$B$7:$B$38,'Deelnemende landen'!$D$7:$D$38)","v":"Uruguay"},null,{"$f":"VLOOKUP(A38,fifaschema!$A$2:$H$49,7,FALSE)","v":42},{"$f":"LOOKUP(G38,'Deelnemende landen'!$B$7:$B$38,'Deelnemende landen'!$D$7:$D$38)","v":"Engeland"},null,"",null,null,31,{"$f":"VLOOKUP(M38,fifaschema!A$2:C$65,2,FALSE)","v":"2014-06-22"},{"$f":"VLOOKUP(M38,fifaschema!A$2:C$65,3,FALSE)","v":"18:00:00"},{"$f":"VLOOKUP(M38,fifaschema!$A$2:$H$49,5,FALSE)","v":80},{"$f":"LOOKUP(P38,'Deelnemende landen'!$B$7:$B$38,'Deelnemende landen'!$D$7:$D$38)","v":"België"},null,{"$f":"VLOOKUP(M38,fifaschema!$A$2:$H$49,7,FALSE)","v":82},{"$f":"LOOKUP(S38,'Deelnemende landen'!$B$7:$B$38,'Deelnemende landen'!$D$7:$D$38)","v":"Rusland"},null,""]
[24,{"$f":"VLOOKUP(A39,fifaschema!A$2:C$65,2,FALSE)","v":"2014-06-20"},{"$f":"VLOOKUP(A39,fifaschema!A$2:C$65,3,FALSE)","v":"18:00:00"},{"$f":"VLOOKUP(A39,fifaschema!$A$2:$H$49,5,FALSE)","v":43},{"$f":"LOOKUP(D39,'Deelnemende landen'!$B$7:$B$38,'Deelnemende landen'!$D$7:$D$38)","v":"Italië"},null,{"$f":"VLOOKUP(A39,fifaschema!$A$2:$H$49,7,FALSE)","v":41},{"$f":"LOOKUP(G39,'Deelnemende landen'!$B$7:$B$38,'Deelnemende landen'!$D$7:$D$38)","v":"Costa Rica"},null,"",null,null,32,{"$f":"VLOOKUP(M39,fifaschema!A$2:C$65,2,FALSE)","v":"2014-06-22"},{"$f":"VLOOKUP(M39,fifaschema!A$2:C$65,3,FALSE)","v":"21:00:00"},{"$f":"VLOOKUP(M39,fifaschema!$A$2:$H$49,5,FALSE)","v":83},{"$f":"LOOKUP(P39,'Deelnemende landen'!$B$7:$B$38,'Deelnemende landen'!$D$7:$D$38)","v":"Zuid-Korea"},null,{"$f":"VLOOKUP(M39,fifaschema!$A$2:$H$49,7,FALSE)","v":81},{"$f":"LOOKUP(S39,'Deelnemende landen'!$B$7:$B$38,'Deelnemende landen'!$D$7:$D$38)","v":"Algerije"},null,""]
[39,{"$f":"VLOOKUP(A40,fifaschema!A$2:C$65,2,FALSE)","v":"2014-06-24"},{"$f":"VLOOKUP(A40,fifaschema!A$2:C$65,3,FALSE)","v":"18:00:00"},{"$f":"VLOOKUP(A40,fifaschema!$A$2:$H$49,5,FALSE)","v":43},{"$f":"LOOKUP(D40,'Deelnemende landen'!$B$7:$B$38,'Deelnemende landen'!$D$7:$D$38)","v":"Italië"},null,{"$f":"VLOOKUP(A40,fifaschema!$A$2:$H$49,7,FALSE)","v":40},{"$f":"LOOKUP(G40,'Deelnemende landen'!$B$7:$B$38,'Deelnemende landen'!$D$7:$D$38)","v":"Uruguay"},null,"",null,null,47,{"$f":"VLOOKUP(M40,fifaschema!A$2:C$65,2,FALSE)","v":"2014-06-26"},{"$f":"VLOOKUP(M40,fifaschema!A$2:C$65,3,FALSE)","v":"22:00:00"},{"$f":"VLOOKUP(M40,fifaschema!$A$2:$H$49,5,FALSE)","v":83},{"$f":"LOOKUP(P40,'Deelnemende landen'!$B$7:$B$38,'Deelnemende landen'!$D$7:$D$38)","v":"Zuid-Korea"},null,{"$f":"VLOOKUP(M40,fifaschema!$A$2:$H$49,7,FALSE)","v":80},{"$f":"LOOKUP(S40,'Deelnemende landen'!$B$7:$B$38,'Deelnemende landen'!$D$7:$D$38)","v":"België"},null,""]
[40,{"$f":"VLOOKUP(A41,fifaschema!A$2:C$65,2,FALSE)","v":"2014-06-24"},{"$f":"VLOOKUP(A41,fifaschema!A$2:C$65,3,FALSE)","v":"18:00:00"},{"$f":"VLOOKUP(A41,fifaschema!$A$2:$H$49,5,FALSE)","v":41},{"$f":"LOOKUP(D41,'Deelnemende landen'!$B$7:$B$38,'Deelnemende landen'!$D$7:$D$38)","v":"Costa Rica"},null,{"$f":"VLOOKUP(A41,fifaschema!$A$2:$H$49,7,FALSE)","v":42},{"$f":"LOOKUP(G41,'Deelnemende landen'!$B$7:$B$38,'Deelnemende landen'!$D$7:$D$38)","v":"Engeland"},null,"",null,null,48,{"$f":"VLOOKUP(M41,fifaschema!A$2:C$65,2,FALSE)","v":"2014-06-26"},{"$f":"VLOOKUP(M41,fifaschema!A$2:C$65,3,FALSE)","v":"22:00:00"},{"$f":"VLOOKUP(M41,fifaschema!$A$2:$H$49,5,FALSE)","v":81},{"$f":"LOOKUP(P41,'Deelnemende landen'!$B$7:$B$38,'Deelnemende landen'!$D$7:$D$38)","v":"Algerije"},null,{"$f":"VLOOKUP(M41,fifaschema!$A$2:$H$49,7,FALSE)","v":82},{"$f":"LOOKUP(S41,'Deelnemende landen'!$B$7:$B$38,'Deelnemende landen'!$D$7:$D$38)","v":"Rusland"},null,""]
[]
[]
[{"$f":"'Deelnemende landen'!G3","v":"1/8 finales"}]
[null,{"$f":"'Deelnemende landen'!G4","v":"1/8 finalist"},null,null,null,null,null,null,null,null,null,null,null,{"$f":"'Deelnemende landen'!G4","v":"1/8 finalist"}]
[null,{"$f":"'Deelnemende landen'!G7","v":"A1"},null,null,{"$f":"IF(D46=\"\",\"\",LOOKUP(D46,'Deelnemende landen'!$B$7:$B$38,'Deelnemende landen'!$D$7:$D$38))","v":""},null,null,null,null,null,null,null,null,{"$f":"'Deelnemende landen'!G15","v":"E1"},null,null,{"$f":"IF(P46=\"\",\"\",LOOKUP(P46,'Deelnemende landen'!$B$7:$B$38,'Deelnemende landen'!$D$7:$D$38))","v":""}]
[null,{"$f":"'Deelnemende landen'!G8","v":"A2"},null,null,{"$f":"IF(D47=\"\",\"\",LOOKUP(D47,'Deelnemende landen'!$B$7:$B$38,'Deelnemende landen'!$D$7:$D$38))","v":""},null,null,null,null,null,null,null,null,{"$f":"'Deelnemende landen'!G16","v":"E2"},null,null,{"$f":"IF(P47=\"\",\"\",LOOKUP(P47,'Deelnemende landen'!$B$7:$B$38,'Deelnemende landen'!$D$7:$D$38))","v":""}]
[null,{"$f":"'Deelnemende landen'!G9","v":"B1"},null,null,{"$f":"IF(D48=\"\",\"\",LOOKUP(D48,'Deelnemende landen'!$B$7:$B$38,'Deelnemende landen'!$D$7:$D$38))","v":""},null,null,null,null,null,null,null,null,{"$f":"'Deelnemende landen'!G17","v":"F1"},null,null,{"$f":"IF(P48=\"\",\"\",LOOKUP(P48,'Deelnemende landen'!$B$7:$B$38,'Deelnemende landen'!$D$7:$D$38))","v":""}]
[null,{"$f":"'Deelnemende landen'!G10","v":"B2"},null,null,{"$f":"IF(D49=\"\",\"\",LOOKUP(D49,'Deelnemende landen'!$B$7:$B$38,'Deelnemende landen'!$D$7:$D$38))","v":""},null,null,null,null,null,null,null,null,{"$f":"'Deelnemende landen'!G18","v":"F2"},null,null,{"$f":"IF(P49=\"\",\"\",LOOKUP(P49,'Deelnemende landen'!$B$7:$B$38,'Deelnemende landen'!$D$7:$D$38))","v":""}]
[]
[]
[null,{"$f":"'Deelnemende landen'!G4","v":"1/8 finalist"},null,null,null,null,null,null,null,null,null,null,null,{"$f":"'Deelnemende landen'!G4","v":"1/8 finalist"}]
[null,{"$f":"'Deelnemende landen'!G11","v":"C1"},null,null,{"$f":"IF(D53=\"\",\"\",LOOKUP(D53,'Deelnemende landen'!$B$7:$B$38,'Deelnemende landen'!$D$7:$D$38))","v":""},null,null,null,null,null,null,null,null,{"$f":"'Deelnemende landen'!G19","v":"G1"},null,null,{"$f":"IF(P53=\"\",\"\",LOOKUP(P53,'Deelnemende landen'!$B$7:$B$38,'Deelnemende landen'!$D$7:$D$38))","v":""}]
[null,{"$f":"'Deelnemende landen'!G12","v":"C2"},null,null,{"$f":"IF(D54=\"\",\"\",LOOKUP(D54,'Deelnemende landen'!$B$7:$B$38,'Deelnemende landen'!$D$7:$D$38))","v":""},null,null,null,null,null,null,null,null,{"$f":"'Deelnemende landen'!G20","v":"G2"},null,null,{"$f":"IF(P54=\"\",\"\",LOOKUP(P54,'Deelnemende landen'!$B$7:$B$38,'Deelnemende landen'!$D$7:$D$38))","v":""}]
[null,{"$f":"'Deelnemende landen'!G13","v":"D1"},null,null,{"$f":"IF(D55=\"\",\"\",LOOKUP(D55,'Deelnemende landen'!$B$7:$B$38,'Deelnemende landen'!$D$7:$D$38))","v":""},null,null,null,null,null,null,null,null,{"$f":"'Deelnemende landen'!G21","v":"H1"},null,null,{"$f":"IF(P55=\"\",\"\",LOOKUP(P55,'Deelnemende landen'!$B$7:$B$38,'Deelnemende landen'!$D$7:$D$38))","v":""}]
[null,{"$f":"'Deelnemende landen'!G14","v":"D2"},null,null,{"$f":"IF(D56=\"\",\"\",LOOKUP(D56,'Deelnemende landen'!$B$7:$B$38,'Deelnemende landen'!$D$7:$D$38))","v":""},null,null,null,null,null,null,null,null,{"$f":"'Deelnemende landen'!G22","v":"H2"},null,null,{"$f":"IF(P56=\"\",\"\",LOOKUP(P56,'Deelnemende landen'!$B$7:$B$38,'Deelnemende landen'!$D$7:$D$38))","v":""}]
[]
[]
["Wedstrijden",null,null,null,null,null,null,null,null,"Gevolg"]
[49,{"$f":"VLOOKUP(A60,fifaschema!A$2:C$65,2,FALSE)","v":"2014-06-28"},{"$f":"VLOOKUP(A60,fifaschema!A$2:C$65,3,FALSE)","v":"18:00:00"},1,{"$f":"E46","v":""},null,2,{"$f":"E49","v":""},null,{"$f":"IF(F60=\"\",4,IF(F60>I60,1,IF(I60>F60,2,IF(F60=\"\",\"\",3))))","v":4}]
[50,{"$f":"VLOOKUP(A61,fifaschema!A$2:C$65,2,FALSE)","v":"2014-06-28"},{"$f":"VLOOKUP(A61,fifaschema!A$2:C$65,3,FALSE)","v":"22:00:00"},1,{"$f":"E53","v":""},null,2,{"$f":"E56","v":""},null,4]
[51,{"$f":"VLOOKUP(A62,fifaschema!A$2:C$65,2,FALSE)","v":"2014-06-29"},{"$f":"VLOOKUP(A62,fifaschema!A$2:C$65,3,FALSE)","v":"18:00:00"},1,{"$f":"E48","v":""},null,2,{"$f":"E47","v":""},null,4]
[52,{"$f":"VLOOKUP(A63,fifaschema!A$2:C$65,2,FALSE)","v":"2014-06-29"},{"$f":"VLOOKUP(A63,fifaschema!A$2:C$65,3,FALSE)","v":"22:00:00"},1,{"$f":"E55","v":""},null,2,{"$f":"E54","v":""},null,4]
[53,{"$f":"VLOOKUP(A64,fifaschema!A$2:C$65,2,FALSE)","v":"2014-06-30"},{"$f":"VLOOKUP(A64,fifaschema!A$2:C$65,3,FALSE)","v":"18:00:00"},1,{"$f":"Q46","v":""},null,2,{"$f":"Q49","v":""},null,4]
[54,{"$f":"VLOOKUP(A65,fifaschema!A$2:C$65,2,FALSE)","v":"2014-06-30"},{"$f":"VLOOKUP(A65,fifaschema!A$2:C$65,3,FALSE)","v":"22:00:00"},1,{"$f":"Q53","v":""},null,2,{"$f":"Q56","v":""},null,4]
[55,{"$f":"VLOOKUP(A66,fifaschema!A$2:C$65,2,FALSE)","v":"2014-07-01"},{"$f":"VLOOKUP(A66,fifaschema!A$2:C$65,3,FALSE)","v":"18:00:00"},1,{"$f":"Q48","v":""},null,2,{"$f":"Q47","v":""},null,4]
[56,{"$f":"VLOOKUP(A67,fifaschema!A$2:C$65,2,FALSE)","v":"2014-07-01"},{"$f":"VLOOKUP(A67,fifaschema!A$2:C$65,3,FALSE)","v":"22:00:00"},1,{"$f":"Q55","v":""},null,2,{"$f":"Q54","v":""},null,4]
[]
[]
[{"$f":"'Deelnemende landen'!I3","v":"1/4 finales"}]
[null,{"$f":"'Deelnemende landen'!I4","v":"1/4 finalist"}]
[null,"Winnaar 49",null,null,{"$f":"IF(D72=\"\",\"\",IF(D72=D60,E60,IF(D72=G60,H60,\"Fout\")))","v":""}]
[null,"Winnaar 50",null,null,""]
[null,"Winnaar 51",null,null,""]
[null,"Winnaar 52",null,null,""]
[null,"Winnaar 53",null,null,""]
[null,"Winnaar 54",null,null,""]
[null,"Winnaar 55",null,null,""]
[null,"Winnaar 56",null,null,""]
[]
[]
["Wedstrijden",null,null,null,null,null,null,null,null,"Gevolg"]
[57,{"$f":"VLOOKUP(A83,fifaschema!A$2:C$65,2,FALSE)","v":"2014-07-04"},{"$f":"VLOOKUP(A83,fifaschema!A$2:C$65,3,FALSE)","v":"18:00:00"},1,{"$f":"E76","v":""},null,2,{"$f":"E77","v":""},null,{"$f":"IF(F83=\"\",4,IF(F83>I83,1,IF(I83>F83,2,IF(F83=\"\",\"\",3))))","v":4}]
[58,{"$f":"VLOOKUP(A84,fifaschema!A$2:C$65,2,FALSE)","v":"2014-07-04"},{"$f":"VLOOKUP(A84,fifaschema!A$2:C$65,3,FALSE)","v":"22:00:00"},1,{"$f":"E72","v":""},null,2,{"$f":"E73","v":""},null,{"$f":"IF(F84=\"\",4,IF(F84>I84,1,IF(I84>F84,2,IF(F84=\"\",\"\",3))))","v":4}]
[59,{"$f":"VLOOKUP(A85,fifaschema!A$2:C$65,2,FALSE)","v":"2014-07-05"},{"$f":"VLOOKUP(A85,fifaschema!A$2:C$65,3,FALSE)","v":"18:00:00"},1,{"$f":"E78","v":""},null,2,{"$f":"E79","v":""},null,{"$f":"IF(F85=\"\",4,IF(F85>I85,1,IF(I85>F85,2,IF(F85=\"\",\"\",3))))","v":4}]
[60,{"$f":"VLOOKUP(A86,fifaschema!A$2:C$65,2,FALSE)","v":"2014-07-05"},{"$f":"VLOOKUP(A86,fifaschema!A$2:C$65,3,FALSE)","v":"22:00:00"},1,{"$f":"E74","v":""},null,2,{"$f":"E75","v":""},null,{"$f":"IF(F86=\"\",4,IF(F86>I86,1,IF(I86>F86,2,IF(F86=\"\",\"\",3))))","v":4}]
[]
[]
[{"$f":"'Deelnemende landen'!J3","v":"Halve finales"}]
[null,{"$f":"'Deelnemende landen'!J4","v":"Halve finalist"}]
[null,"Winnaar 57",null,null,{"$f":"IF(D91=\"\",\"\",IF(D91=D83,E83,IF(D91=G83,H83,\"Fout\")))","v":""}]
[null,"Winnaar 58",null,null,{"$f":"IF(D92=\"\",\"\",IF(D92=D84,E84,IF(D92=G84,H84,\"Fout\")))","v":""}]
[null,"Winnaar 59",null,null,{"$f":"IF(D93=\"\",\"\",IF(D93=D85,E85,IF(D93=G85,H85,\"Fout\")))","v":""}]
[null,"Winnaar 60",null,null,{"$f":"IF(D94=\"\",\"\",IF(D94=D86,E86,IF(D94=G86,H86,\"Fout\")))","v":""}]
[]
[]
["Wedstrijden",null,null,null,null,null,null,null,null,"Gevolg"]
[61,{"$f":"VLOOKUP(A98,fifaschema!A$2:C$65,2,FALSE)","v":"2014-07-08"},{"$f":"VLOOKUP(A98,fifaschema!A$2:C$65,3,FALSE)","v":"22:00:00"},1,{"$f":"E92","v":""},null,2,{"$f":"E91","v":""},null,{"$f":"IF(F98=\"\",4,IF(F98>I98,1,IF(I98>F98,2,IF(F98=\"\",\"\",3))))","v":4}]
[62,{"$f":"VLOOKUP(A99,fifaschema!A$2:C$65,2,FALSE)","v":"2014-07-09"},{"$f":"VLOOKUP(A99,fifaschema!A$2:C$65,3,FALSE)","v":"22:00:00"},1,{"$f":"E94","v":""},null,2,{"$f":"E93","v":""},null,{"$f":"IF(F99=\"\",4,IF(F99>I99,1,IF(I99>F99,2,IF(F99=\"\",\"\",3))))","v":4}]
[]
[]
[{"$f":"'Deelnemende landen'!L3","v":"Finales"}]
[null,{"$f":"'Deelnemende landen'!L4","v":"Finalist"}]
[null,"Winnaar 61",null,null,{"$f":"IF(D104=\"\",\"\",IF(D104=D98,E98,IF(D104=G98,H98,\"Fout\")))","v":""},null,null,{"$f":"IF(D104=\"\",\"\",IF(D104=G98,E98,IF(D104=D98,H98,\"Fout\")))","v":""}]
[null,"Winnaar 62",null,null,{"$f":"IF(D105=\"\",\"\",IF(D105=D99,E99,IF(D105=G99,H99,\"Fout\")))","v":""},null,null,{"$f":"IF(D105=\"\",\"\",IF(D105=G99,E99,IF(D105=D99,H99,\"Fout\")))","v":""}]
[]
[]
["Kleine finale",null,null,null,null,null,null,null,null,"Gevolg"]
[63,{"$f":"VLOOKUP(A109,fifaschema!A$2:C$65,2,FALSE)","v":"2014-07-12"},{"$f":"VLOOKUP(A109,fifaschema!A$2:C$65,3,FALSE)","v":"22:00:00"},1,{"$f":"H104","v":""},null,2,{"$f":"H105","v":""},null,{"$f":"IF(F109=\"\",4,IF(F109>I109,1,IF(I109>F109,2,IF(F109=\"\",\"\",3))))","v":4}]
[]
["Finale",null,null,null,null,null,null,null,null,"Gevolg"]
[64,{"$f":"VLOOKUP(A112,fifaschema!A$2:C$65,2,FALSE)","v":"2014-07-13"},{"$f":"VLOOKUP(A112,fifaschema!A$2:C$65,3,FALSE)","v":"21:00:00"},1,{"$f":"E104","v":""},null,2,{"$f":"E105","v":""},null,{"$f":"IF(F112=\"\",4,IF(F112>I112,1,IF(I112>F112,2,IF(F112=\"\",\"\",3))))","v":4}]
[]
[null,{"$f":"'Deelnemende landen'!E1","v":"Wereldkampioen"},null,null,null,null,null,{"$f":"IF(G114=\"\",\"\",IF(G114=D112,E112,IF(G114=G112,H112,\"Fout\")))","v":""}]

{"sheet":"Deelnemende landen","index":2,"n_rows":38,"n_cols":12,"rows_kept":38,"cut":false,"hidden":true,"merged":[]}
["Deelnemende landen",null,null,null,"Wereldkampioen",null,null,"Speelschema WK 2014"]
[]
["Benodigd voor poulewedstrijden",null,null,null,null,null,"1/8 finales",null,"1/4 finales","Halve finales",null,"Finales"]
[null,null,null,null,null,null,"1/8 finalist",null,"1/4 finalist","Halve finalist",null,"Finalist"]
["Nr","#","Land",null,null,null,"Nr","Land"]
[]
[1,10,"Brazilië",{"$f":"C7","v":"Brazilië"},null,null,"A1",{"$f":"LOOKUP(G7,Schema!$B$46:$B$47,Schema!$E$46:$E$47)","v":""}]
[2,11,"Kroatië","Kroatië",null,null,"A2",{"$f":"LOOKUP(G8,Schema!$B$46:$B$47,Schema!$E$46:$E$47)","v":""}]
[3,12,"Mexico","Mexico",null,null,"B1",{"$f":"LOOKUP(G9,Schema!$B$48:$B$49,Schema!$E$48:$E$49)","v":""}]
[4,13,"Kameroen","Kameroen",null,null,"B2",{"$f":"LOOKUP(G10,Schema!$B$48:$B$49,Schema!$E$48:$E$49)","v":""}]
[5,20,"Spanje","Spanje",null,null,"C1",{"$f":"LOOKUP(G11,Schema!$B$53:$B$54,Schema!$E$53:$E$54)","v":""}]
[6,21,"Nederland","Nederland",null,null,"C2",{"$f":"LOOKUP(G12,Schema!$B$53:$B$54,Schema!$E$53:$E$54)","v":""}]
[7,22,"Chili","Chili",null,null,"D1",{"$f":"LOOKUP(G13,Schema!$B$55:$B$56,Schema!$E$55:$E$56)","v":""}]
[8,23,"Australië","Australië",null,null,"D2",{"$f":"LOOKUP(G14,Schema!$B$55:$B$56,Schema!$E$55:$E$56)","v":""}]
[9,30,"Colombia","Colombia",null,null,"E1",{"$f":"LOOKUP(G15,Schema!$N$46:$N$47,Schema!$Q$46:$Q$47)","v":""}]
[10,31,"Griekenland","Griekenland",null,null,"E2",{"$f":"LOOKUP(G16,Schema!$N$46:$N$47,Schema!$Q$46:$Q$47)","v":""}]
[11,32,"Ivoorkust","Ivoorkust",null,null,"F1",{"$f":"LOOKUP(G17,Schema!$N$48:$N$49,Schema!$Q$48:$Q$49)","v":""}]
[12,33,"Japan","Japan",null,null,"F2",{"$f":"LOOKUP(G18,Schema!$N$48:$N$49,Schema!$Q$48:$Q$49)","v":""}]
[13,40,"Uruguay","Uruguay",null,null,"G1",{"$f":"LOOKUP(G19,Schema!$N$53:$N$54,Schema!$Q$53:$Q$54)","v":""}]
[14,41,"Costa Rica","Costa Rica",null,null,"G2",{"$f":"LOOKUP(G20,Schema!$N$53:$N$54,Schema!$Q$53:$Q$54)","v":""}]
[15,42,"Engeland","Engeland",null,null,"H1",{"$f":"LOOKUP(G21,Schema!$N$55:$N$56,Schema!$Q$55:$Q$56)","v":""}]
[16,43,"Italië","Italië",null,null,"H2",{"$f":"LOOKUP(G22,Schema!$N$55:$N$56,Schema!$Q$55:$Q$56)","v":""}]
[17,50,"Zwitserland","Zwitserland"]
[18,51,"Ecuador","Ecuador"]
[19,52,"Frankrijk","Frankrijk"]
[20,53,"Honduras","Honduras"]
[21,60,"Argentinië","Argentinië"]
[22,61,"Bosnië Herzegovina","Bosnië Herzegovina"]
[23,62,"Iran","Iran"]
[24,63,"Nigeria","Nigeria"]
[25,70,"Duitsland","Duitsland"]
[26,71,"Portugal","Portugal"]
[27,72,"Ghana","Ghana"]
[28,73,"USA","USA"]
[29,80,"België","België"]
[30,81,"Algerije","Algerije"]
[31,82,"Rusland","Rusland"]
[32,83,"Zuid-Korea","Zuid-Korea"]

{"sheet":"fifaschema","index":3,"n_rows":65,"n_cols":12,"rows_kept":65,"cut":false,"hidden":true,"merged":[]}
["Match","Datum","Tijd","Stadion",null,"Thuisploeg",null,"Uitploeg",null,null,"Hulp voor nummers landen"]
[1,"2014-06-12","22:00:00","Sao Paulo",{"$f":"VLOOKUP(F2,$K$2:$L$33,2,FALSE)","v":10},"Brazilië",{"$f":"VLOOKUP(H2,$K$2:$L$33,2,FALSE)","v":11},"Kroatië",null,null,"Brazilië",10]
[2,"2014-06-13","18:00:00","Natal",{"$f":"VLOOKUP(F3,$K$2:$L$33,2,FALSE)","v":12},"Mexico",13,"Kameroen",null,null,"Kroatië",11]
[3,"2014-06-13","21:00:00","Salvador",20,"Spanje",21,"Nederland",null,null,"Mexico",12]
[4,"2014-06-13","00:00:00","Cuiaba",22,"Chili",23,"Australië",null,null,"Kameroen",13]
[5,"2014-06-14","18:00:00","Belo Horizonte",30,"Colombia",31,"Griekenland",null,null,"Spanje",20]
[6,"2014-06-14","03:00:00","Recife",32,"Ivoorkust",33,"Japan",null,null,"Nederland",21]
[7,"2014-06-14","21:00:00","Fortaleza",40,"Uruguay",41,"Costa Rica",null,null,"Chili",22]
[8,"2014-06-14","00:00:00","Manaus",42,"Engeland",43,"Italië",null,null,"Australië",23]
[9,"2014-06-15","18:00:00","Brasilia",50,"Zwitserland",51,"Ecuador",null,null,"Colombia",30]
[10,"2014-06-15","21:00:00","Porto Alegre",52,"Frankrijk",53,"Honduras",null,null,"Griekenland",31]
[11,"2014-06-15","00:00:00","Rio De Janeiro",60,"Argentinië",61,"Bosnië Herzegovina",null,null,"Ivoorkust",32]
[12,"2014-06-16","21:00:00","Curitiba",62,"Iran",63,"Nigeria",null,null,"Japan",33]
[13,"2014-06-16","18:00:00","Salvador",70,"Duitsland",71,"Portugal",null,null,"Uruguay",40]
[14,"2014-06-16","00:00:00","Natal",72,"Ghana",73,"USA",null,null,"Costa Rica",41]
[15,"2014-06-17","18:00:00","Belo Horizonte",80,"België",81,"Algerije",null,null,"Engeland",42]
[16,"2014-06-17","00:00:00","Cuiaba",82,"Rusland",83,"Zuid-Korea",null,null,"Italië",43]
[17,"2014-06-17","21:00:00","Fortaleza",10,"Brazilië",12,"Mexico",null,null,"Zwitserland",50]
[18,"2014-06-18","00:00:00","Manaus",13,"Kameroen",11,"Kroatië",null,null,"Ecuador",51]
[19,"2014-06-18","21:00:00","Rio De Janeiro",20,"Spanje",22,"Chili",null,null,"Frankrijk",52]
[20,"2014-06-18","18:00:00","Porto Alegre",23,"Australië",21,"Nederland",null,null,"Honduras",53]
[21,"2014-06-19","18:00:00","Brasilia",30,"Colombia",32,"Ivoorkust",null,null,"Argentinië",60]
[22,"2014-06-19","00:00:00","Natal",33,"Japan",31,"Griekenland",null,null,"Bosnië Herzegovina",61]
[23,"2014-06-19","21:00:00","Sao Paulo",40,"Uruguay",42,"Engeland",null,null,"Iran",62]
[24,"2014-06-20","18:00:00","Recife",43,"Italië",41,"Costa Rica",null,null,"Nigeria",63]
[25,"2014-06-20","21:00:00","Salvador",50,"Zwitserland",52,"Frankrijk",null,null,"Duitsland",70]
[26,"2014-06-20","00:00:00","Curitiba",53,"Honduras",51,"Ecuador",null,null,"Portugal",71]
[27,"2014-06-21","18:00:00","Belo Horizonte",60,"Argentinië",62,"Iran",null,null,"Ghana",72]
[28,"2014-06-21","00:00:00","Cuiaba",63,"Nigeria",61,"Bosnië Herzegovina",null,null,"USA",73]
[29,"2014-06-21","21:00:00","Fortaleza",70,"Duitsland",72,"Ghana",null,null,"België",80]
[30,"2014-06-22","00:00:00","Manaus",73,"USA",71,"Portugal",null,null,"Algerije",81]
[31,"2014-06-22","18:00:00","Rio De Janeiro",80,"België",82,"Rusland",null,null,"Rusland",82]
[32,"2014-06-22","21:00:00","Porto Alegre",83,"Zuid-Korea",81,"Algerije",null,null,"Zuid-Korea",83]
[33,"2014-06-23","22:00:00","Brasilia",13,"Kameroen",10,"Brazilië"]
[34,"2014-06-23","22:00:00","Recife",11,"Kroatië",12,"Mexico"]
[35,"2014-06-23","18:00:00","Curitiba",23,"Australië",20,"Spanje"]
[36,"2014-06-23","18:00:00","Sao Paulo",21,"Nederland",22,"Chili"]
[37,"2014-06-24","22:00:00","Cuiaba",33,"Japan",30,"Colombia"]
[38,"2014-06-24","22:00:00","Fortaleza",31,"Griekenland",32,"Ivoorkust"]
[39,"2014-06-24","18:00:00","Natal",43,"Italië",40,"Uruguay"]
[40,"2014-06-24","18:00:00","Belo Horizonte",41,"Costa Rica",42,"Engeland"]
[41,"2014-06-25","22:00:00","Manaus",53,"Honduras",50,"Zwitserland"]
[42,"2014-06-25","22:00:00","Rio De Janeiro",51,"Ecuador",52,"Frankrijk"]
[43,"2014-06-25","18:00:00","Porto Alegre",63,"Nigeria",60,"Argentinië"]
[44,"2014-06-25","18:00:00","Salvador",61,"Bosnië Herzegovina",62,"Iran"]
[45,"2014-06-26","18:00:00","Recife",73,"USA",70,"Duitsland"]
[46,"2014-06-26","18:00:00","Brasilia",71,"Portugal",72,"Ghana"]
[47,"2014-06-26","22:00:00","Sao Paulo",83,"Zuid-Korea",80,"België"]
[48,"2014-06-26","22:00:00","Curitiba",81,"Algerije",82,"Rusland"]
[49,"2014-06-28","18:00:00"," Belo Horizonte",null,"1A","-","2B",null,"Winnaar groep A","Tweede groep B","AF 1"]
[50,"2014-06-28","22:00:00"," Rio de Janeiro",null,"1C","-","2D",null,"Winnaar groep C","Tweede groep D","AF 2"]
[51,"2014-06-29","18:00:00"," Fortaleza",null,"1B","-","2A",null,"Winnaar groep B","Tweede groep A","AF 3"]
[52,"2014-06-29","22:00:00"," Recife",null,"1D","-","2C",null,"Winnaar groep D","Tweede groep C","AF 4"]
[53,"2014-06-30","18:00:00"," Brasilia",null,"1E","-","2F",null,"Winnaar groep E","Tweede groep F","AF 5"]
[54,"2014-06-30","22:00:00"," Porto Alegre",null,"1G","-","2H",null,"Winnaar groep G","Tweede groep H","AF 6"]
[55,"2014-07-01","18:00:00"," Sao Paulo",null,"1F","-","2E",null,"Winnaar groep F","Tweede groep E","AF 7"]
[56,"2014-07-01","22:00:00"," Salvador",null,"1H","-","2G",null,"Winnaar groep H","Tweede groep G","AF 8"]
[57,"2014-07-04","18:00:00"," Rio de Janeiro",null,"W53","-","W54",null,"Winnaar AF 5","Winnaar AF 6","KF 1"]
[58,"2014-07-04","22:00:00"," Fortaleza",null,"W49","-","W50",null,"Winnaar AF 1","Winnaar AF 2","KF 2"]
[59,"2014-07-05","18:00:00"," Brasilia",null,"W55","-","W56",null,"Winnaar AF 7","Winnaar AF 8","KF 3"]
[60,"2014-07-05","22:00:00"," Salvador",null,"W51","-","W52",null,"Winnaar AF 3","Winnaar AF 4","KF 4"]
[61,"2014-07-08","22:00:00"," Belo Horizonte",null,"W58","-","W57",null,"Winnaar KF 2","Winnaar KF 1","HF 1"]
[62,"2014-07-09","22:00:00"," Sao Paulo",null,"W60","-","W59",null,"Winnaar KF 4","Winnaar KF 3","HF 2"]
[63,"2014-07-12","22:00:00"," Brasilia",null,"L61","-","L62",null,"Verliezer HF 1","Verliezer HF 2","Troostfinale"]
[64,"2014-07-13","21:00:00"," Rio de Janeiro",null,"W61","-","W62",null,"Winnaar HF 1","Winnaar HF 2","Finale"]