{"text_format":"1","workbook":"xlsx","n_sheets":4,"sheets":["Opgaveblad","Schema","Deelnemende landen","fifaschema"],"not_rendered":{"charts":0,"images":1,"macros":1,"external_links":0,"defined_names":2,"comments":1,"pivot_tables":0},"unopened":[],"bounds":{"document_bytes":16777216,"sheet_cells":100000,"rows_first":2000,"rows_last":500,"rows_between":2000,"halvings":0,"cell_chars":16384,"cell_head_chars":4096},"cells_cut":0,"cells_raw":0,"read":"whole","date_system":"1900"}

{"sheet":"Opgaveblad","index":0,"n_rows":101,"n_cols":191,"rows_kept":101,"cut":false,"hidden":false,"merged":[[4,4,4,8],[0,4,0,8],[1,4,1,8],[2,4,2,8],[3,4,3,8]]}
["Naam:",null,null,null,null,null,null,null,null,null,"Inschrijvingen en betaling dienen uiterlijk 12.06.2010 om 22.00 uur in het  bezit te zijn ",null,null,null,null,null,null,null,null,null,null,null,null,null,null,null,null,{"$f":"E1","v":0},{"$f":"E2","v":0},{"$f":"E3","v":0},{"$f":"F10","v":0},{"$f":"I10","v":0},{"$f":"F11","v":0},{"$f":"I11","v":0},{"$f":"F12","v":0},{"$f":"I12","v":0},{"$f":"F13","v":0},{"$f":"I13","v":0},{"$f":"F14","v":0},{"$f":"I14","v":0},{"$f":"F15","v":0},{"$f":"I15","v":0},{"$f":"F18","v":0},{"$f":"I18","v":0},{"$f":"F19","v":0},{"$f":"I19","v":0},{"$f":"F20","v":0},{"$f":"I20","v":0},{"$f":"F21","v":0},{"$f":"I21","v":0},{"$f":"F22","v":0},{"$f":"I22","v":0},{"$f":"F23","v":0},{"$f":"I23","v":0},{"$f":"F26","v":0},{"$f":"I26","v":0},{"$f":"F27","v":0},{"$f":"I27","v":0},{"$f":"F28","v":0},{"$f":"I28","v":0},{"$f":"F29","v":0},{"$f":"I29","v":0},{"$f":"F30","v":0},{"$f":"I30","v":0},{"$f":"F31","v":0},{"$f":"I31","v":0},{"$f":"F34","v":0},{"$f":"I34","v":0},{"$f":"F35","v":0},{"$f":"I35","v":0},{"$f":"F36","v":0},{"$f":"I36","v":0},{"$f":"F37","v":0},{"$f":"I37","v":0},{"$f":"F38","v":0},{"$f":"I38","v":0},{"$f":"F39","v":0},{"$f":"I39","v":0},{"$f":"P10","v":0},{"$f":"S10","v":0},{"$f":"P11","v":0},{"$f":"S11","v":0},{"$f":"P12","v":0},{"$f":"S12","v":0},{"$f":"P13","v":0},{"$f":"S13","v":0},{"$f":"P14","v":0},{"$f":"S14","v":0},{"$f":"P15","v":0},{"$f":"S15","v":0},{"$f":"P18","v":0},{"$f":"S18","v":0},{"$f":"P19","v":0},{"$f":"S19","v":0},{"$f":"P20","v":0},{"$f":"S20","v":0},{"$f":"P21","v":0},{"$f":"S21","v":0},{"$f":"P22","v":0},{"$f":"S22","v":0},{"$f":"P23","v":0},{"$f":"S23","v":0},{"$f":"P26","v":0},{"$f":"S26","v":0},{"$f":"P27","v":0},{"$f":"S27","v":0},{"$f":"P28","v":0},{"$f":"S28","v":0},{"$f":"P29","v":0},{"$f":"S29","v":0},{"$f":"P30","v":0},{"$f":"S30","v":0},{"$f":"P31","v":0},{"$f":"S31","v":0},{"$f":"P34","v":0},{"$f":"S34","v":0},{"$f":"P35","v":0},{"$f":"S35","v":0},{"$f":"P36","v":0},{"$f":"S36","v":0},{"$f":"P37","v":0},{"$f":"S37","v":0},{"$f":"P38","v":0},{"$f":"S38","v":0},{"$f":"P39","v":0},{"$f":"S39","v":0},{"$f":"D43","v":0},{"$f":"D44","v":0},{"$f":"D45","v":0},{"$f":"D46","v":0},{"$f":"D47","v":0},{"$f":"D48","v":0},{"$f":"D49","v":0},{"$f":"D50","v":0},{"$f":"N43","v":0},{"$f":"N44","v":0},{"$f":"N45","v":0},{"$f":"N46","v":0},{"$f":"N47","v":0},{"$f":"N48","v":0},{"$f":"N49","v":0},{"$f":"N50","v":0},{"$f":"F53","v":0},{"$f":"I53","v":0},{"$f":"F54","v":0},{"$f":"I54","v":0},{"$f":"F55","v":0},{"$f":"I55","v":0},{"$f":"F56","v":0},{"$f":"I56","v":0},{"$f":"F57","v":0},{"$f":"I57","v":0},{"$f":"F58","v":0},{"$f":"I58","v":0},{"$f":"F59","v":0},{"$f":"I59","v":0},{"$f":"F60","v":0},{"$f":"I60","v":0},{"$f":"D64","v":0},{"$f":"D65","v":0},{"$f":"D66","v":0},{"$f":"D67","v":0},{"$f":"D68","v":0},{"$f":"D69","v":0},{"$f":"D70","v":0},{"$f":"D71","v":0},{"$f":"F74","v":0},{"$f":"I74","v":0},{"$f":"F75","v":0},{"$f":"I75","v":0},{"$f":"F76","v":0},{"$f":"I76","v":0},{"$f":"F77","v":0},{"$f":"I77","v":0},{"$f":"D81","v":0},{"$f":"D82","v":0},{"$f":"D83","v":0},{"$f":"D84","v":0},{"$f":"F87","v":0},{"$f":"I87","v":0},{"$f":"F88","v":0},{"$f":"I88","v":0},{"$f":"D92","v":0},{"$f":"D93","v":0},{"$f":"F96","v":0},{"$f":"I96","v":0},{"$f":"F99","v":0},{"$f":"I99","v":0},{"$f":"G101","v":0},{"$f":"E4","v":0},{"$f":"E5","v":0}]
["Adres:",null,null,null,null,null,null,null,null,null,"van de organisatie. Formulieren bij voorkeur mailen naar: "]
["Woonplaats:",null,null,null,null,null,null,null,null,null,null,"voetbalpoule.jammerdan@gmail.com"]
["E-mail:",null,null,null,null,null,null,null,null,null,"Betalingen en niet-digitale formulieren inleveren bij:"]
["Ik betaal aan:",null,null,null,null,null,null,null,null,null,"Uwe, Alfred, Berné, Ekkel, Niels, Jurgen, Het Oude Station"]
["Groepswedstrijden",null,null,null,"U dient van iedere wedstrijd de uitslag te voorspellen (stand na afloop van de reguliere speeltijd van 2x3 kwartier)."]
[null,null,null,null,"Poulewedstrijden: juiste voorspelling winst, verlies of een gelijkspel ",null,null,null,null,null,null,null,null,null," = ","3 punten (toto)"]
[null,"Groep A",null,null,"Poulewedstrijden: juiste voorspelling winst, verlies of een gelijkspel en de juiste uitslag",null,null,null,null,null,null,null,null,null," = ","3 punten extra (uitslag)"]
[null,"Wedstrijden",null,null,null,null,null,null,"3 punten voor Toto + 3 bonuspunten voor juiste uitslag",null,null,"Wedstrijden",null,null,null,null,null,null,"3 punten voor Toto + 3 bonuspunten voor juiste uitslag"]
[null,{"$f":"Schema!B9","v":"2014-06-12"},{"$f":"Schema!C9","v":"22:00:00"},{"$f":"Schema!D9","v":10},{"$f":"LOOKUP(D10,'Deelnemende landen'!$B$7:$B$38,'Deelnemende landen'!$D$7:$D$38)","v":"Brazilië"},null,{"$f":"Schema!G9","v":11},{"$f":"LOOKUP(G10,'Deelnemende landen'!$B$7:$B$38,'Deelnemende landen'!$D$7:$D$38)","v":"Kroatië"},null,null,null,{"$f":"Schema!N9","v":"2014-06-15"},{"$f":"Schema!O9","v":"18:00:00"},{"$f":"Schema!P9","v":50},{"$f":"LOOKUP(N10,'Deelnemende landen'!$B$7:$B$38,'Deelnemende landen'!$D$7:$D$38)","v":"Zwitserland"},null,{"$f":"Schema!S9","v":51},{"$f":"LOOKUP(Q10,'Deelnemende landen'!$B$7:$B$38,'Deelnemende landen'!$D$7:$D$38)","v":"Ecuador"}]
[null,{"$f":"Schema!B10","v":"2014-06-13"},{"$f":"Schema!C10","v":"18:00:00"},{"$f":"Schema!D10","v":12},{"$f":"LOOKUP(D11,'Deelnemende landen'!$B$7:$B$38,'Deelnemende landen'!$D$7:$D$38)","v":"Mexico"},null,{"$f":"Schema!G10","v":13},{"$f":"LOOKUP(G11,'Deelnemende landen'!$B$7:$B$38,'Deelnemende landen'!$D$7:$D$38)","v":"Kameroen"},null,null,null,{"$f":"Schema!N10","v":"2014-06-15"},{"$f":"Schema!O10","v":"21:00:00"},{"$f":"Schema!P10","v":52},{"$f":"LOOKUP(N11,'Deelnemende landen'!$B$7:$B$38,'Deelnemende landen'!$D$7:$D$38)","v":"Frankrijk"},null,{"$f":"Schema!S10","v":53},{"$f":"LOOKUP(Q11,'Deelnemende landen'!$B$7:$B$38,'Deelnemende landen'!$D$7:$D$38)","v":"Honduras"}]
[null,{"$f":"Schema!B11","v":"2014-06-17"},{"$f":"Schema!C11","v":"21:00:00"},{"$f":"Schema!D11","v":10},{"$f":"LOOKUP(D12,'Deelnemende landen'!$B$7:$B$38,'Deelnemende landen'!$D$7:$D$38)","v":"Brazilië"},null,{"$f":"Schema!G11","v":12},{"$f":"LOOKUP(G12,'Deelnemende landen'!$B$7:$B$38,'Deelnemende landen'!$D$7:$D$38)","v":"Mexico"},null,null,null,{"$f":"Schema!N11","v":"2014-06-20"},{"$f":"Schema!O11","v":"21:00:00"},{"$f":"Schema!P11","v":50},{"$f":"LOOKUP(N12,'Deelnemende landen'!$B$7:$B$38,'Deelnemende landen'!$D$7:$D$38)","v":"Zwitserland"},null,{"$f":"Schema!S11","v":52},{"$f":"LOOKUP(Q12,'Deelnemende landen'!$B$7:$B$38,'Deelnemende landen'!$D$7:$D$38)","v":"Frankrijk"}]
[null,{"$f":"Schema!B12","v":"2014-06-18"},{"$f":"Schema!C12","v":"00:00:00"},{"$f":"Schema!D12","v":13},{"$f":"LOOKUP(D13,'Deelnemende landen'!$B$7:$B$38,'Deelnemende landen'!$D$7:$D$38)","v":"Kameroen"},null,{"$f":"Schema!G12","v":11},{"$f":"LOOKUP(G13,'Deelnemende landen'!$B$7:$B$38,'Deelnemende landen'!$D$7:$D$38)","v":"Kroatië"},null,null,null,{"$f":"Schema!N12","v":"2014-06-20"},{"$f":"Schema!O12","v":"00:00:00"},{"$f":"Schema!P12","v":53},{"$f":"LOOKUP(N13,'Deelnemende landen'!$B$7:$B$38,'Deelnemende landen'!$D$7:$D$38)","v":"Honduras"},null,{"$f":"Schema!S12","v":51},{"$f":"LOOKUP(Q13,'Deelnemende landen'!$B$7:$B$38,'Deelnemende landen'!$D$7:$D$38)","v":"Ecuador"}]
[null,{"$f":"Schema!B13","v":"2014-06-23"},{"$f":"Schema!C13","v":"22:00:00"},{"$f":"Schema!D13","v":13},{"$f":"LOOKUP(D14,'Deelnemende landen'!$B$7:$B$38,'Deelnemende landen'!$D$7:$D$38)","v":"Kameroen"},null,{"$f":"Schema!G13","v":10},{"$f":"LOOKUP(G14,'Deelnemende landen'!$B$7:$B$38,'Deelnemende landen'!$D$7:$D$38)","v":"Brazilië"},null,null,null,{"$f":"Schema!N13","v":"2014-06-25"},{"$f":"Schema!O13","v":"22:00:00"},{"$f":"Schema!P13","v":53},{"$f":"LOOKUP(N14,'Deelnemende landen'!$B$7:$B$38,'Deelnemende landen'!$D$7:$D$38)","v":"Honduras"},null,{"$f":"Schema!S13","v":50},{"$f":"LOOKUP(Q14,'Deelnemende landen'!$B$7:$B$38,'Deelnemende landen'!$D$7:$D$38)","v":"Zwitserland"}]
[null,{"$f":"Schema!B14","v":"2014-06-23"},{"$f":"Schema!C14","v":"22:00:00"},{"$f":"Schema!D14","v":11},{"$f":"LOOKUP(D15,'Deelnemende landen'!$B$7:$B$38,'Deelnemende landen'!$D$7:$D$38)","v":"Kroatië"},null,{"$f":"Schema!G14","v":12},{"$f":"LOOKUP(G15,'Deelnemende landen'!$B$7:$B$38,'Deelnemende landen'!$D$7:$D$38)","v":"Mexico"},null,null,null,{"$f":"Schema!N14","v":"2014-06-25"},{"$f":"Schema!O14","v":"22:00:00"},{"$f":"Schema!P14","v":51},{"$f":"LOOKUP(N15,'Deelnemende landen'!$B$7:$B$38,'Deelnemende landen'!$D$7:$D$38)","v":"Ecuador"},null,{"$f":"Schema!S14","v":52},{"$f":"LOOKUP(Q15,'Deelnemende landen'!$B$7:$B$38,'Deelnemende landen'!$D$7:$D$38)","v":"Frankrijk"}]
{"$rows_left_out":87}
{"sheet":"Schema","index":1,"n_rows":114,"n_cols":49,"rows_kept":114,"cut":false,"hidden":true,"merged":[]}
[{"$f":"'Deelnemende landen'!H1","v":"Speelschema WK 2014"},null,null,null,null,null,null,null,null,null,null,null,null,null,null,null,null,null,null,null,null,null,null,null,null,null,null,null,null,null,null,null,null,null,null,null,null,null,null,null,null,null,null,null,null,null,null,null,"15:00:00"]
[null,null,null,null,null,null,null,null,null,null,null,null,null,null,null,null,null,null,null,null,null,null,null,null,null,null,null,null,null,null,null,null,null,null,null,null,null,null,null,null,null,null,null,null,null,null,null,null,"16:00:00"]
[null,null,null,null,null,null,null,null,null,null,null,null,null,null,null,null,null,null,null,null,null,null,null,null,null,null,null,null,null,null,null,null,null,null,null,null,null,null,null,null,null,null,null,null,null,null,null,null,"18:00:00"]
[null,null,null,null,null,null,null,null,null,null,null,null,null,null,null,null,null,null,null,null,null,null,null,null,null,null,null,null,null,null,null,null,null,null,null,null,null,null,null,null,null,null,null,null,null,null,null,null,"21:00:00"]
[]
["Groepswedstrijden"]
[null,"Groep A",null,null,null,null,null,null,null,null,null,null,null,"Groep E"]
[null,"Wedstrijden",null,null,null,null,null,null,null,"Gevolg",null,null,null,"Wedstrijden",null,null,null,null,null,null,null,"Gevolg"]
[1,{"$f":"VLOOKUP(A9,fifaschema!A$2:C$65,2,FALSE)","v":"2014-06-12"},{"$f":"VLOOKUP(A9,fifaschema!A$2:C$65,3,FALSE)","v":"22:00:00"},{"$f":"VLOOKUP(A9,fifaschema!$A$2:$H$49,5,FALSE)","v":10},{"$f":"LOOKUP(D9,'Deelnemende landen'!$B$7:$B$38,'Deelnemende landen'!$D$7:$D$38)","v":"Brazilië"},null,{"$f":"VLOOKUP(A9,fifaschema!$A$2:$H$49,7,FALSE)","v":11},{"$f":"LOOKUP(G9,'Deelnemende landen'!$B$7:$B$38,'Deelnemende landen'!$D$7:$D$38)","v":"Kroatië"},null,{"$f":"IF(F9>I9,1,IF(I9>F9,2,IF(F9=\"\",\"\",3)))","v":""},null,null,9,{"$f":"VLOOKUP(M9,fifaschema!A$2:C$65,2,FALSE)","v":"2014-06-15"},{"$f":"VLOOKUP(M9,fifaschema!A$2:C$65,3,FALSE)","v":"18:00:00"},{"$f":"VLOOKUP(M9,fifaschema!$A$2:$H$49,5,FALSE)","v":50},{"$f":"LOOKUP(P9,'Deelnemende landen'!$B$7:$B$38,'Deelnemende landen'!$D$7:$D$38)","v":"Zwitserland"},null,{"$f":"VLOOKUP(M9,fifaschema!$A$2:$H$49,7,FALSE)","v":51},{"$f":"LOOKUP(S9,'Deelnemende landen'!$B$7:$B$38,'Deelnemende landen'!$D$7:$D$38)","v":"Ecuador"},null,{"$f":"IF(R9>U9,1,IF(U9>R9,2,IF(R9=\"\",\"\",3)))","v":""}]
[2,{"$f":"VLOOKUP(A10,fifaschema!A$2:C$65,2,FALSE)","v":"2014-06-13"},{"$f":"VLOOKUP(A10,fifaschema!A$2:C$65,3,FALSE)","v":"18:00:00"},{"$f":"VLOOKUP(A10,fifaschema!$A$2:$H$49,5,FALSE)","v":12},{"$f":"LOOKUP(D10,'Deelnemende landen'!$B$7:$B$38,'Deelnemende landen'!$D$7:$D$38)","v":"Mexico"},null,{"$f":"VLOOKUP(A10,fifaschema!$A$2:$H$49,7,FALSE)","v":13},{"$f":"LOOKUP(G10,'Deelnemende landen'!$B$7:$B$38,'Deelnemende landen'!$D$7:$D$38)","v":"Kameroen"},null,"",null,null,10,{"$f":"VLOOKUP(M10,fifaschema!A$2:C$65,2,FALSE)","v":"2014-06-15"},{"$f":"VLOOKUP(M10,fifaschema!A$2:C$65,3,FALSE)","v":"21:00:00"},{"$f":"VLOOKUP(M10,fifaschema!$A$2:$H$49,5,FALSE)","v":52},{"$f":"LOOKUP(P10,'Deelnemende landen'!$B$7:$B$38,'Deelnemende landen'!$D$7:$D$38)","v":"Frankrijk"},null,{"$f":"VLOOKUP(M10,fifaschema!$A$2:$H$49,7,FALSE)","v":53},{"$f":"LOOKUP(S10,'Deelnemende landen'!$B$7:$B$38,'Deelnemende landen'!$D$7:$D$38)","v":"Honduras"},null,""]
[17,{"$f":"VLOOKUP(A11,fifaschema!A$2:C$65,2,FALSE)","v":"2014-06-17"},{"$f":"VLOOKUP(A11,fifaschema!A$2:C$65,3,FALSE)","v":"21:00:00"},{"$f":"VLOOKUP(A11,fifaschema!$A$2:$H$49,5,FALSE)","v":10},{"$f":"LOOKUP(D11,'Deelnemende landen'!$B$7:$B$38,'Deelnemende landen'!$D$7:$D$38)","v":"Brazilië"},null,{"$f":"VLOOKUP(A11,fifaschema!$A$2:$H$49,7,FALSE)","v":12},{"$f":"LOOKUP(G11,'Deelnemende landen'!$B$7:$B$38,'Deelnemende landen'!$D$7:$D$38)","v":"Mexico"},null,"",null,null,25,{"$f":"VLOOKUP(M11,fifaschema!A$2:C$65,2,FALSE)","v":"2014-06-20"},{"$f":"VLOOKUP(M11,fifaschema!A$2:C$65,3,FALSE)","v":"21:00:00"},{"$f":"VLOOKUP(M11,fifaschema!$A$2:$H$49,5,FALSE)","v":50},{"$f":"LOOKUP(P11,'Deelnemende landen'!$B$7:$B$38,'Deelnemende landen'!$D$7:$D$38)","v":"Zwitserland"},null,{"$f":"VLOOKUP(M11,fifaschema!$A$2:$H$49,7,FALSE)","v":52},{"$f":"LOOKUP(S11,'Deelnemende landen'!$B$7:$B$38,'Deelnemende landen'!$D$7:$D$38)","v":"Frankrijk"},null,""]
[18,{"$f":"VLOOKUP(A12,fifaschema!A$2:C$65,2,FALSE)","v":"2014-06-18"},{"$f":"VLOOKUP(A12,fifaschema!A$2:C$65,3,FALSE)","v":"00:00:00"},{"$f":"VLOOKUP(A12,fifaschema!$A$2:$H$49,5,FALSE)","v":13},{"$f":"LOOKUP(D12,'Deelnemende landen'!$B$7:$B$38,'Deelnemende landen'!$D$7:$D$38)","v":"Kameroen"},null,{"$f":"VLOOKUP(A12,fifaschema!$A$2:$H$49,7,FALSE)","v":11},{"$f":"LOOKUP(G12,'Deelnemende landen'!$B$7:$B$38,'Deelnemende landen'!$D$7:$D$38)","v":"Kroatië"},null,"",null,null,26,{"$f":"VLOOKUP(M12,fifaschema!A$2:C$65,2,FALSE)","v":"2014-06-20"},{"$f":"VLOOKUP(M12,fifaschema!A$2:C$65,3,FALSE)","v":"00:00:00"},{"$f":"VLOOKUP(M12,fifaschema!$A$2:$H$49,5,FALSE)","v":53},{"$f":"LOOKUP(P12,'Deelnemende landen'!$B$7:$B$38,'Deelnemende landen'!$D$7:$D$38)","v":"Honduras"},null,{"$f":"VLOOKUP(M12,fifaschema!$A$2:$H$49,7,FALSE)","v":51},{"$f":"LOOKUP(S12,'Deelnemende landen'!$B$7:$B$38,'Deelnemende landen'!$D$7:$D$38)","v":"Ecuador"},null,""]
[33,{"$f":"VLOOKUP(A13,fifaschema!A$2:C$65,2,FALSE)","v":"2014-06-23"},{"$f":"VLOOKUP(A13,fifaschema!A$2:C$65,3,FALSE)","v":"22:00:00"},{"$f":"VLOOKUP(A13,fifaschema!$A$2:$H$49,5,FALSE)","v":13},{"$f":"LOOKUP(D13,'Deelnemende landen'!$B$7:$B$38,'Deelnemende landen'!$D$7:$D$38)","v":"Kameroen"},null,{"$f":"VLOOKUP(A13,fifaschema!$A$2:$H$49,7,FALSE)","v":10},{"$f":"LOOKUP(G13,'Deelnemende landen'!$B$7:$B$38,'Deelnemende landen'!$D$7:$D$38)","v":"Brazilië"},null,"",null,null,41,{"$f":"VLOOKUP(M13,fifaschema!A$2:C$65,2,FALSE)","v":"2014-06-25"},{"$f":"VLOOKUP(M13,fifaschema!A$2:C$65,3,FALSE)","v":"22:00:00"},{"$f":"VLOOKUP(M13,fifaschema!$A$2:$H$49,5,FALSE)","v":53},{"$f":"LOOKUP(P13,'Deelnemende landen'!$B$7:$B$38,'Deelnemende landen'!$D$7:$D$38)","v":"Honduras"},null,{"$f":"VLOOKUP(M13,fifaschema!$A$2:$H$49,7,FALSE)","v":50},{"$f":"LOOKUP(S13,'Deelnemende landen'!$B$7:$B$38,'Deelnemende landen'!$D$7:$D$38)","v":"Zwitserland"},null,""]
[34,{"$f":"VLOOKUP(A14,fifaschema!A$2:C$65,2,FALSE)","v":"2014-06-23"},{"$f":"VLOOKUP(A14,fifaschema!A$2:C$65,3,FALSE)","v":"22:00:00"},{"$f":"VLOOKUP(A14,fifaschema!$A$2:$H$49,5,FALSE)","v":11},{"$f":"LOOKUP(D14,'Deelnemende landen'!$B$7:$B$38,'Deelnemende landen'!$D$7:$D$38)","v":"Kroatië"},null,{"$f":"VLOOKUP(A14,fifaschema!$A$2:$H$49,7,FALSE)","v":12},{"$f":"LOOKUP(G14,'Deelnemende landen'!$B$7:$B$38,'Deelnemende landen'!$D$7:$D$38)","v":"Mexico"},null,"",null,null,42,{"$f":"VLOOKUP(M14,fifaschema!A$2:C$65,2,FALSE)","v":"2014-06-25"},{"$f":"VLOOKUP(M14,fifaschema!A$2:C$65,3,FALSE)","v":"22:00:00"},{"$f":"VLOOKUP(M14,fifaschema!$A$2:$H$49,5,FALSE)","v":51},{"$f":"LOOKUP(P14,'Deelnemende landen'!$B$7:$B$38,'Deelnemende landen'!$D$7:$D$38)","v":"Ecuador"},null,{"$f":"VLOOKUP(M14,fifaschema!$A$2:$H$49,7,FALSE)","v":52},{"$f":"LOOKUP(S14,'Deelnemende landen'!$B$7:$B$38,'Deelnemende landen'!$D$7:$D$38)","v":"Frankrijk"},null,""]
[]
{"$rows_left_out":100}
{"sheet":"Deelnemende landen","index":2,"n_rows":38,"n_cols":12,"rows_kept":38,"cut":false,"hidden":true,"merged":[]}
["Deelnemende landen",null,null,null,"Wereldkampioen",null,null,"Speelschema WK 2014"]
[]
["Benodigd voor poulewedstrijden",null,null,null,null,null,"1/8 finales",null,"1/4 finales","Halve finales",null,"Finales"]
[null,null,null,null,null,null,"1/8 finalist",null,"1/4 finalist","Halve finalist",null,"Finalist"]
["Nr","#","Land",null,null,null,"Nr","Land"]
[]
[1,10,"Brazilië",{"$f":"C7","v":"Brazilië"},null,null,"A1",{"$f":"LOOKUP(G7,Schema!$B$46:$B$47,Schema!$E$46:$E$47)","v":""}]
[2,11,"Kroatië","Kroatië",null,null,"A2",{"$f":"LOOKUP(G8,Schema!$B$46:$B$47,Schema!$E$46:$E$47)","v":""}]
[3,12,"Mexico","Mexico",null,null,"B1",{"$f":"LOOKUP(G9,Schema!$B$48:$B$49,Schema!$E$48:$E$49)","v":""}]
[4,13,"Kameroen","Kameroen",null,null,"B2",{"$f":"LOOKUP(G10,Schema!$B$48:$B$49,Schema!$E$48:$E$49)","v":""}]
[5,20,"Spanje","Spanje",null,null,"C1",{"$f":"LOOKUP(G11,Schema!$B$53:$B$54,Schema!$E$53:$E$54)","v":""}]
[6,21,"Nederland","Nederland",null,null,"C2",{"$f":"LOOKUP(G12,Schema!$B$53:$B$54,Schema!$E$53:$E$54)","v":""}]
[7,22,"Chili","Chili",null,null,"D1",{"$f":"LOOKUP(G13,Schema!$B$55:$B$56,Schema!$E$55:$E$56)","v":""}]
[8,23,"Australië","Australië",null,null,"D2",{"$f":"LOOKUP(G14,Schema!$B$55:$B$56,Schema!$E$55:$E$56)","v":""}]
[9,30,"Colombia","Colombia",null,null,"E1",{"$f":"LOOKUP(G15,Schema!$N$46:$N$47,Schema!$Q$46:$Q$47)","v":""}]
{"$rows_left_out":24}
{"sheet":"fifaschema","index":3,"n_rows":65,"n_cols":12,"rows_kept":65,"cut":false,"hidden":true,"merged":[]}
["Match","Datum","Tijd","Stadion",null,"Thuisploeg",null,"Uitploeg",null,null,"Hulp voor nummers landen"]
[1,"2014-06-12","22:00:00","Sao Paulo",{"$f":"VLOOKUP(F2,$K$2:$L$33,2,FALSE)","v":10},"Brazilië",{"$f":"VLOOKUP(H2,$K$2:$L$33,2,FALSE)","v":11},"Kroatië",null,null,"Brazilië",10]
[2,"2014-06-13","18:00:00","Natal",{"$f":"VLOOKUP(F3,$K$2:$L$33,2,FALSE)","v":12},"Mexico",13,"Kameroen",null,null,"Kroatië",11]
[3,"2014-06-13","21:00:00","Salvador",20,"Spanje",21,"Nederland",null,null,"Mexico",12]
[4,"2014-06-13","00:00:00","Cuiaba",22,"Chili",23,"Australië",null,null,"Kameroen",13]
[5,"2014-06-14","18:00:00","Belo Horizonte",30,"Colombia",31,"Griekenland",null,null,"Spanje",20]
[6,"2014-06-14","03:00:00","Recife",32,"Ivoorkust",33,"Japan",null,null,"Nederland",21]
[7,"2014-06-14","21:00:00","Fortaleza",40,"Uruguay",41,"Costa Rica",null,null,"Chili",22]
[8,"2014-06-14","00:00:00","Manaus",42,"Engeland",43,"Italië",null,null,"Australië",23]
[9,"2014-06-15","18:00:00","Brasilia",50,"Zwitserland",51,"Ecuador",null,null,"Colombia",30]
[10,"2014-06-15","21:00:00","Porto Alegre",52,"Frankrijk",53,"Honduras",null,null,"Griekenland",31]
[11,"2014-06-15","00:00:00","Rio De Janeiro",60,"Argentinië",61,"Bosnië Herzegovina",null,null,"Ivoorkust",32]
[12,"2014-06-16","21:00:00","Curitiba",62,"Iran",63,"Nigeria",null,null,"Japan",33]
[13,"2014-06-16","18:00:00","Salvador",70,"Duitsland",71,"Portugal",null,null,"Uruguay",40]
[14,"2014-06-16","00:00:00","Natal",72,"Ghana",73,"USA",null,null,"Costa Rica",41]
{"$rows_left_out":50}